{"text_format":"1","workbook":"xlsx","n_sheets":10,"sheets":["Pay","Developer's desk","Information & Rules","ENTRY","G.A. 55","COMPUTATION","HRA","16 NO.","89(1)form","Form10E"],"not_rendered":{"charts":0,"images":2,"macros":1,"external_links":1,"defined_names":47,"comments":0,"pivot_tables":0},"unopened":[],"bounds":{"document_bytes":16777216,"sheet_cells":100000,"rows_first":2000,"rows_last":500,"rows_between":2000,"halvings":0,"cell_chars":16384,"cell_head_chars":4096},"cells_cut":0,"cells_raw":0,"read":"whole","date_system":"1900"}

{"sheet":"Pay","index":0,"n_rows":86,"n_cols":31,"rows_kept":86,"cut":false,"hidden":true,"merged":[[4,1,4,8],[0,4,0,5],[1,1,1,8],[1,25,3,27],[2,1,2,8],[3,1,3,8],[5,1,5,2],[5,4,5,5],[5,7,5,8],[6,1,6,2],[6,4,6,5],[6,7,6,8],[7,1,7,2],[7,3,7,8],[7,25,8,27],[8,1,8,2],[8,4,8,5],[8,7,8,8],[40,10,40,18],[40,19,40,25],[40,26,40,29],[9,1,9,2],[9,4,9,5],[9,7,9,8],[10,1,10,2],[10,4,10,5],[11,1,11,3],[11,5,11,8],[41,7,41,8],[86,1,87,2],[15,5,15,7],[24,1,24,4],[24,5,24,8]]}
[]
[null,"Presented By :- VIJAY RANWA, TEACHER, GSS DHANERU"]
[null,"7th Pay Commission Calculator- http://www.vijayranwa.jimdo.com"]
[null,"SALARY Calculator of 7'th Pay Commission"]
[]
[null,"Name of employee :-",null,"VIJAY RANWA","vijay ranwa",null,null,"fot; j.koka"]
[null,"Designation of employee :-",null,"TEACHER","teacher",null,null,"v/;kid",null,"Fix Pay"]
[null,"Name of Department / Office :-",null,"GOVT SEC SCHOOL DHANERU"]
{"$rows_left_out":79}
{"sheet":"Developer's desk","index":1,"n_rows":20,"n_cols":10,"rows_kept":20,"cut":false,"hidden":false,"merged":[[19,7,19,8],[19,2,19,5],[19,0,19,1],[19,9,19,12],[18,0,18,12],[0,0,0,12],[2,0,2,12],[3,0,3,12],[4,1,4,12],[5,1,5,12],[17,0,17,12],[1,0,1,12],[15,1,15,12],[10,1,10,12],[11,1,11,12],[13,1,13,12],[14,1,14,12],[16,1,16,12],[6,1,6,12],[7,1,7,12],[8,0,8,12],[9,0,9,12],[12,1,12,12]]}
["FROM THE DEVELOPER'S DESK"]
["If you have Hindi font problem, then first you should install Hindi font KRUTI DEV 010  in your computer."]
["vk;dj x.kuk ds fy, ;g odZcqd dsoy jktLFkku jkT; ds deZpkfj;ksa ds fy, rS;kj dh x;h gSA"]
["bl odZcqd esa fuEu lqfo/kk,a miYkC/k gSa&"]
[null,"¼v½ th,&55 ,oa vk;dj x.kuk 'khV dk vkWVkstusjs'ku"]
[null,"¼c½ QkWeZ 16 dk vkWVkstusjs'ku"]
[null,"¼l½ /kkjk 89(1) ds vUrxZr iwoZ o\"kksZa ds ,fj;j ij iznÙk NwV dh x.kuk ,oa QkWeZ 10E dk vkWVkstusjs'ku"]
[null,"¼n½ edku fdjk;k NwV dh x.kuk ,oa edku fdjk;k jlhn dk vkWVkstujs'ku"]
{"$rows_left_out":13}
{"sheet":"Information & Rules","index":2,"n_rows":117,"n_cols":2,"rows_kept":117,"cut":false,"hidden":false,"merged":[[1,0,1,1],[2,0,2,1]]}
[null,"Auto Income Tax Calculator       By - Vijay Ranwa, Teacher"]
["                                                For the Financial year 2017- 18, ASSESSMENT YEAR 2018-19                                                       .                      "]
["                  Brief detail of Information and RULES for(Rates,Deductions,Exemption etc.)                                                                             "]
[null," Follow theTax Rules & Informations (where applicable). "]
[1,"New Tax  Rates  for Financial-Year 2017-18, Assessment Year  2018-2019"]
[2,"Some  Exempted Receipts / Special allowances &  Perquisite which are not chargable to tax"]
[3,"Some Exempted Income ( to be shown while Return filing) "]
[4,"T A X   R U L E S  &  O T H E R   U S E F U L   I N F O R M A T I O N S"]
{"$rows_left_out":110}
{"sheet":"ENTRY","index":3,"n_rows":67,"n_cols":11,"rows_kept":67,"cut":false,"hidden":false,"merged":[[66,5,66,11],[22,5,23,11],[24,5,25,11],[43,5,43,11],[27,5,29,11],[31,5,32,11],[1,10,1,11],[3,5,3,6],[3,7,3,8],[4,5,4,8],[1,5,1,8],[64,1,64,3],[33,1,33,2],[63,2,63,3],[38,5,41,11],[54,5,55,11],[57,5,58,11],[44,5,45,11],[34,5,36,11],[47,5,52,11],[60,5,62,11],[64,5,64,11],[11,3,12,3],[25,1,25,2],[13,3,17,3],[9,5,9,8],[11,5,11,8],[18,5,20,11],[11,9,11,11],[12,9,12,11],[13,9,13,11],[21,5,21,8],[21,9,21,11],[17,9,17,11],[14,5,14,8],[16,5,16,8],[17,5,17,8],[12,5,12,8],[5,10,5,11],[5,5,5,7],[2,10,2,11],[2,5,2,8],[3,9,3,11],[13,5,13,8],[1,1,1,3],[3,1,3,3],[10,2,10,3],[7,5,7,11],[10,5,10,8],[6,1,6,3],[6,5,6,11],[8,5,8,8],[8,9,8,11],[9,9,9,11],[10,9,10,11],[2,1,2,3],[5,1,5,3],[4,9,4,10],[4,2,4,3]]}
[]
[null,"INCOME TAX CALCULATION FOR FINANCIAL YEAR 2017-2018 & Assessment year 2018-19",null,null,null,{"$f":"TODAY()","v":"2017-12-28"},null,null,null,null,"WHATSAPP NO. - 9828113904"]
[null,"DEVELOPED BY VIJAY RANWA - TEACHER, GOVT. SECONDARY SCHOOL",null,null,null,"WWW.GSSAMARPURA.JIMDO.COM",null,null,null,null,"www.vijayranwa.jimdo.com"]
[null,"   DHANERU, SRIDUNGARGARH (BIKANER) Mo.- 9828113904",null,null,null,null,null,null,null,"leL;k vkus ij व्हाट्सएप्प ij lEidZ djsaA"]
[null,"As per the Finance Bill, 2017","Mail ID :- vijaysalasar2011@gmail.com"]
[null,"Enter the Data in                      Other cells will calculate data & Tax automatically.       ",null,null,null,"LAST UPDATED",null,null,"2017-12-25"]
[null,"Employee's Details",null,null,null,"Employer / DDO Details"]
[null,"Name Of Employee","VIJAY",null,null,"16 No. Form  rS;kj djus ds fy, fuEu dkWyeks dh iwfrZ djsaA"]
{"$rows_left_out":60}
{"sheet":"G.A. 55","index":4,"n_rows":32,"n_cols":34,"rows_kept":32,"cut":false,"hidden":false,"merged":[[0,1,0,20],[3,1,3,2],[3,19,3,20],[3,3,3,7],[3,11,3,15],[3,8,3,10],[3,16,3,18],[1,1,1,20],[5,0,6,0],[5,1,6,1],[4,1,4,20],[26,21,31,23],[19,21,25,23],[28,13,28,18],[28,7,28,10],[5,8,5,18],[27,13,27,16],[5,20,6,20],[0,21,5,23],[5,19,6,19],[27,1,27,2],[5,2,5,6],[5,7,6,7],[26,1,26,2]]}
[null,{"$f":"\" Office of the  \"&ENTRY!C11","v":" Office of the   GOVT SECONDARY SCHOOLDHANERU (BIKANER)"},null,null,null,null,null,null,null,null,null,null,null,null,null,null,null,null,null,null,null,"आप जीपीएफ़ कटौती मे बदलाव करना चाहते हो तो इच्छित माह मे कटौती की राशि लिखे l सेवानिवृति के कारण कार्मिक की कटौती बंद करनी है तो संबंधित माह के आगे कॉलम मे लिखी राशि DELETE  करे l",null,null,null,null,null,null,null,{"$f":"ENTRY!C20","v":0},{"$f":"IF(AD1=0,0,IF(AD1<=3,3,IF(AD1<=6,1,IF(AD1<=9,2,IF(AD1<=12,3,0)))))","v":0},{"$f":"ENTRY!C16","v":11}]
[null,"Salary and Deduction Detail for FY 2017-2018 & Assessment Year 2018-19",null,null,null,null,null,null,null,null,null,null,null,null,null,null,null,null,null,null,null,null,null,null,null,null,null,null,{"$f":"ENTRY!C16","v":11},{"$f":"IF(AD1=0,0,IF(AD1<4,1,IF(AD1>9,1,0)))","v":0}]
[]
[null,"Name",null,{"$f":"UPPER(ENTRY!C8)","v":"VIJAY"},null,null,null,null,"Designation",null,null,{"$f":"UPPER(ENTRY!C9)","v":" TEACHER"},null,null,null,null,"PAN NO.",null,null,{"$f":"UPPER(ENTRY!C10)","v":"EFNPS7790B"},null,null,null,null,null,null,null,null,{"$f":"IF(AND(AC2>10,AD4>9),C17/2-C15/2,0)","v":0},{"$f":"IF(OR(AD1=10,AD1=11,AD1=12,AD1=1,AD1=2),(C19/2-C20),0)","v":0},{"$f":"IF(OR(AD1=10,AD1=11,AD1=12,AD1=1,AD1=2),ROUND(D19/2,0)-ROUND(D20,0))","v":false},{"$f":"AD4+AE4","v":0}]
[null,null,null,null,null,null,null,null,null,null,null,null,null,null,null,null,null,null,null,null,null,null,null,null,null,null,{"$f":"IF(ENTRY!C12=\"METRO\", 20,10)","v":10},null,null,{"$f":"IF(AD1=0,0,IF(AD1=3,D19,VLOOKUP(AD1,A9:D19,4,FALSE)))/2","v":0}]
["S. No.","MONTH","Allowance",null,null,null,null,"Gross Amount","Deductions",null,null,null,null,null,null,null,null,null,null,"Net Payment","Bill/TV No. & Date",null,null,null,null,null,null,null,null,{"$f":"IF(AD1=0,0,VLOOKUP(AD1,AG8:AH20,2,FALSE))","v":0}]
[null,null,"BASIC","DA","HRA ","CCA","Other",null,"NPS","GPF","GPF LOAN","RPMF","SI","SI Loan","HFRH","LIC","GI Pre.","INCOME TAX","TOTAL",null,null,"MONTH",null,"GPF DEDU."]
[3,"2017-03-01",{"$f":"ENTRY!C14","v":21290},{"$f":"ROUND(C8*132%, 0)","v":28103},{"$f":"IF(ENTRY!C$12=\"metro\",C8*20%,IF(ENTRY!C$12=\"Non-Metro\",C8*10%, \"\"))","v":2129},{"$f":"IF(ENTRY!$C$12=\"metro\",IF(ENTRY!$C$13=\"Jaipur\",IF(C8<=7000,190,IF(C8<=9000,300,480)),IF(C8<=7000,70,IF(C8<=9000,130,240))),\"\")","v":""},null,{"$f":"SUM(C8:G8)","v":51522},{"$f":"IF(ENTRY!$C$17=\"NPS\",ROUND((C8+D8)*10%,0),\"\")","v":4939},{"$f":"IF(ENTRY!C17=\"GPF\",W8,\"\")","v":""},null,{"$f":"IF(ENTRY!C$17=\"GPF\", IF(C8<=7000,199,IF(C8<=13000,331,IF(C8<=21000,496,660))), \"\")","v":""},{"$f":"AB8","v":2650},null,{"$f":"IF(E8=\"\",IF(C8<13000,ROUND(C8*0.75%,0),IF(C8<19000,ROUND(C8*1.5%,0),ROUND(C8*2%,0))),\"\")","v":""},{"$f":"ENTRY!C38","v":0},null,{"$f":"ENTRY!C19","v":1000},{"$f":"SUM(I8:R8)","v":8589},{"$f":"H8-S8","v":42933},null,{"$f":"B8","v":"2017-03-01"},{"$f":"IF(ENTRY!C$17=\"GPF\", IF(C8<=9000,500,IF(C8<=11000,650,IF(C8<=15000,1100,IF(C8<=20000,1450,IF(C8<=24000,2100, IF(C8<=28000,3300,IF(C8<=31000,4100,IF(C8<=45000,5200,IF(C8<=65000,5700,6200))))))))),\"\")","v":""},0,{"$f":"IF(X8=\"\",\"\",IF(X8=0,W8,X8))","v":""},{"$f":"IF(ENTRY!C18=\"\",\"\",ENTRY!C18)","v":2650},{"$f":"IF(C8<=8500,400,IF(C8<=11000,550,IF(C8<=18000,1100,IF(C8<=28000,1550,2650))))","v":1550},{"$f":"IF(Z8=\"\",0,IF(Z8>0,Z8,AA8))","v":2650}]
{"$rows_left_out":25}
{"sheet":"COMPUTATION","index":5,"n_rows":57,"n_cols":19,"rows_kept":57,"cut":false,"hidden":false,"merged":[[22,18,25,22],[49,0,49,11],[51,11,51,12],[27,1,27,7],[28,0,36,0],[28,1,28,12],[29,1,29,11],[30,1,30,11],[31,1,31,11],[32,1,32,11],[33,1,33,11],[34,1,34,11],[35,1,35,11],[36,1,36,11],[39,1,39,11],[27,8,27,9],[54,1,54,12],[55,1,55,12],[40,0,44,0],[41,1,41,11],[42,1,42,11],[44,1,44,11],[43,7,43,10],[43,1,43,4],[43,5,43,6],[45,1,45,11],[46,1,46,11],[40,1,40,7],[47,0,48,0],[47,1,48,3],[47,4,47,5],[47,6,47,7],[48,6,48,7],[47,10,47,11],[48,10,48,11],[48,4,48,5],[52,11,52,12],[51,3,51,4],[50,1,50,3],[50,4,50,5],[16,2,16,5],[16,8,16,10],[17,2,17,5],[15,0,27,0],[19,2,19,5],[16,12,23,12],[25,12,26,12],[12,1,12,3],[12,4,12,5],[12,6,12,7],[12,8,12,9],[12,10,12,11],[13,1,13,3],[13,4,13,5],[13,6,13,7],[13,8,13,9],[13,10,13,11],[18,2,18,5],[18,8,18,10],[11,0,13,0],[11,1,11,11],[14,1,14,11],[15,1,15,12],[0,0,0,12],[1,0,1,12],[2,9,2,10],[9,1,10,2],[9,3,9,5],[9,8,9,9],[4,1,4,11],[5,1,5,11],[6,1,6,9],[6,10,6,11],[9,10,9,11],[10,3,10,5],[10,8,10,9],[10,10,10,11],[7,1,7,11],[8,0,10,0],[8,1,8,7],[8,8,8,9],[8,10,8,11],[2,4,2,7],[3,8,3,10],[3,1,3,5],[3,6,3,7],[3,18,6,21],[56,9,56,12],[56,1,56,7],[21,2,21,5],[27,10,27,11],[2,1,2,3],[9,6,9,7],[10,6,10,7],[21,8,21,10],[22,2,22,5],[22,8,22,10],[23,2,23,5],[23,8,23,10],[19,8,19,10],[20,2,20,5],[20,8,20,10],[25,1,25,10],[26,1,26,10],[17,8,17,10],[37,1,37,11],[24,2,24,5],[24,7,24,10],[38,1,38,11]]}
[{"$f":"'G.A. 55'!B1","v":" Office of the   GOVT SECONDARY SCHOOLDHANERU (BIKANER)"}]
["vk;dj x.kuk izi= foRrh; o\"kZ 2017&2018 ¼dj fu/kkZj.k o\"kZ 2018&2019½"]
[1,"uke deZpkjh %",null,null,{"$f":"'G.A. 55'!D4","v":"VIJAY"},null,null,null," in %",{"$f":"'G.A. 55'!L4","v":" TEACHER"},null,"PAN NO :-",{"$f":"'G.A. 55'!T4","v":"EFNPS7790B"}]
[2,"osru en esa vk; ¼HkÙkksa lfgr½",null,null,null,null,{"$f":"'G.A. 55'!H26","v":704966},null,{"$f":" IF(ENTRY!C17=\"GPF\",  \"\", \"(+ Govt. Contri. towards NPS)\")","v":"(+ Govt. Contri. towards NPS)"},null,null,{"$f":" IF(ENTRY!C17=\"NPS\", L17,\"\")","v":66022},{"$f":"G4+L17","v":770988},null,null,null,null,null,{"$f":"IF(L4=\"\",\"\",\"ljdkj }kjk ,uih,l esa tks jkf'k tek djokbZ xbZ gSa] og jkf'k ;gk¡ ldy vk; esa tksM+h xbZ gSaA\")","v":"ljdkj }kjk ,uih,l esa tks jkf'k tek djokbZ xbZ gSa] og jkf'k ;gk¡ ldy vk; esa tksM+h xbZ gSaA"}]
[3,"x`g fdjk;k] HkÙkk /kkjk 10¼13&A½ ds vUrxZr ,oa /kkjk 10¼14½ ds vUrxZr vU; HkÙks tks dj eqDÙk gSA",null,null,null,null,null,null,null,null,null,null,{"$f":"ENTRY!D20+ENTRY!C24","v":0}]
[4,"                                                              'ks\"k ¼2&3½",null,null,null,null,null,null,null,null,null,null,{"$f":"M4-M5","v":770988}]
[5," ¼i½euksjatu HkÙkk /kkjk 16 ¼ii½ ds vUrxZr ¼ vf/kdre lhek : 5000 ½",null,null,null,null,null,null,null,null,null,null,{"$f":"ENTRY!C23","v":0}]
[6,"                                                           'ks\"k ¼4&5½",null,null,null,null,null,null,null,null,null,null,{"$f":"M6-M7","v":770988}]
{"$rows_left_out":50}
{"sheet":"HRA","index":6,"n_rows":42,"n_cols":22,"rows_kept":42,"cut":false,"hidden":false,"merged":[[14,5,15,10],[17,6,17,9],[8,13,8,20],[41,1,41,21],[38,1,38,21],[40,1,40,21],[39,1,39,21],[33,1,33,21],[34,1,34,21],[35,1,35,21],[36,1,36,21],[37,1,37,21],[32,1,32,21],[13,13,13,15],[17,19,17,21],[9,14,9,20],[0,12,0,21],[2,12,2,21],[15,13,15,15],[21,1,21,7],[31,1,31,21],[22,1,30,7],[0,1,0,10],[1,1,1,10],[24,12,24,21],[13,6,13,8],[2,1,2,10],[3,6,4,9],[5,6,6,9],[8,6,8,8],[9,6,9,8],[12,6,12,8]]}
[null,"THIS SOFTWARE MADE BY VIJAY RANWA",null,null,null,null,null,null,null,null,null,null,"RECEIPT OF HOUSE RENT"]
[null," TEACHER GOVT SECONDARY SCHOOL DHANERU, BIKANER"]
[null,"PARTIAL HRA EXEMPTION WORK SHEET",null,null,null,null,null,null,null,null,null,null,"(Under section 1 (13-A) of Income Tax Act)"]
[null,"MONTHS","\"Y\"","Basic Pay.","HRA",null,"Please select months by typing \"Y\" "]
[null,"MARCH 17","Y",{"$f":"IF(C5=\"Y\",'G.A. 55'!C8+ROUND((136%*'G.A. 55'!C8),0),\"0\")","v":50244},{"$f":"IF(C5=\"Y\",'G.A. 55'!E8,\"0\")","v":2129},null,null,null,null,null,null,null,null,null,null,null,null,null,null,null,"Date :-",{"$f":"TODAY()","v":"2017-12-28"}]
[null,"APRIL 17","Y",{"$f":"IF(C6=\"Y\",'G.A. 55'!C9+ROUND((136%*'G.A. 55'!C9),0),\"0\")","v":50244},{"$f":"IF(C6=\"Y\",'G.A. 55'!E9,\"0\")","v":2129},null,"After selecting months, give rent paid amount. "]
[null,"MAY 17","Y",{"$f":"IF(C7=\"Y\",'G.A. 55'!C10+ROUND((136%*'G.A. 55'!C10),0),\"0\")","v":50244},{"$f":"IF(C7=\"Y\",'G.A. 55'!E10,\"0\")","v":2129},null,null,null,null,null,null,null,null,{"$f":"CONCATENATE(\" I Owner     \", UPPER(ENTRY!C22))","v":" I Owner     "}]
[null,"JUNE 17","Y",{"$f":"IF(C8=\"Y\",'G.A. 55'!C11+ROUND((136%*'G.A. 55'!C11),0),\"0\")","v":50244},{"$f":"IF(C8=\"Y\",'G.A. 55'!E11,\"0\")","v":2129},null,null,null,null,null,null,null,null,null,{"$f":"\"           Received with Thanks from    \"&ENTRY!C8&\"\"","v":"           Received with Thanks from    VIJAY"}]
{"$rows_left_out":35}
{"sheet":"16 NO.","index":7,"n_rows":138,"n_cols":10,"rows_kept":138,"cut":false,"hidden":false,"merged":[[0,0,0,10],[1,0,1,10],[2,0,2,10],[3,0,3,10],[8,0,8,2],[8,3,8,4],[8,5,8,7],[8,8,8,10],[12,0,12,10],[9,0,9,4],[9,5,9,6],[9,7,9,10],[4,0,4,4],[4,5,4,10],[5,5,5,10],[6,5,6,10],[7,0,7,2],[7,3,7,4],[7,5,7,7],[7,8,7,10],[6,0,6,4],[5,0,5,4],[105,5,105,6],[118,5,118,6],[118,7,118,8],[93,5,93,6],[121,0,121,4],[114,1,114,4],[115,1,115,4],[116,1,116,4],[117,1,117,4],[118,1,118,4],[119,5,119,6],[119,7,119,8],[115,7,115,8],[116,5,116,6],[116,7,116,8],[114,5,114,6],[114,7,114,8],[100,5,100,6],[98,3,98,4],[103,5,103,6],[92,7,102,8],[120,0,120,2],[120,3,120,4],[106,1,106,4],[13,1,13,3],[13,5,13,7],[13,8,13,10],[14,1,14,3],[14,5,14,7],[14,8,14,10],[10,1,10,4],[10,5,11,6],[10,7,10,8],[10,9,10,10],[11,1,11,2],[11,7,11,8],[11,9,11,10],[17,1,17,3],[17,5,17,7],[17,8,17,10],[18,0,18,3],[18,5,18,7],[18,8,18,10],[15,1,15,3],[15,5,15,7],[15,8,15,10],[16,1,16,3],[16,5,16,7],[16,8,16,10],[23,1,23,2],[23,5,23,7],[23,8,23,10],[24,1,24,2],[24,5,24,7],[24,8,24,10],[19,0,19,10],[20,0,20,10],[21,0,22,0],[21,1,22,2],[21,3,21,10],[22,5,22,7],[22,8,22,10],[27,1,27,2],[27,5,27,7],[27,8,27,10],[28,1,28,2],[28,5,28,7],[28,8,28,10],[25,1,25,2],[25,5,25,7],[25,8,25,10],[26,1,26,2],[26,5,26,7],[26,8,26,10],[31,1,31,2],[31,5,31,7],[31,8,31,10],[32,1,32,2],[32,5,32,7],[32,8,32,10],[29,1,29,2],[29,5,29,7],[29,8,29,10],[30,1,30,2],[30,5,30,7],[30,8,30,10],[35,1,35,2],[35,5,35,7],[35,8,35,10],[36,1,36,2],[36,5,36,7],[36,8,36,10],[33,1,33,2],[33,5,33,7],[33,8,33,10],[34,1,34,2],[34,5,34,7],[34,8,34,10],[39,0,39,10],[40,0,41,0],[40,1,41,2],[40,3,40,10],[41,3,41,4],[41,5,41,6],[41,7,41,8],[41,9,41,10],[37,1,37,2],[37,3,37,10],[38,0,38,10],[42,1,42,2],[42,3,42,4],[42,5,42,6],[42,7,42,8],[42,9,42,10],[43,1,43,2],[43,3,43,4],[43,5,43,6],[43,7,43,8],[43,9,43,10],[44,1,44,2],[44,3,44,4],[44,5,44,6],[44,7,44,8],[44,9,44,10],[45,1,45,2],[45,3,45,4],[45,5,45,6],[45,7,45,8],[45,9,45,10],[46,1,46,2],[46,3,46,4],[46,5,46,6],[46,7,46,8],[46,9,46,10],[47,1,47,2],[47,3,47,4],[47,5,47,6],[47,7,47,8],[47,9,47,10],[48,1,48,2],[48,3,48,4],[48,5,48,6],[48,7,48,8],[48,9,48,10],[49,1,49,2],[49,3,49,4],[49,5,49,6],[49,7,49,8],[49,9,49,10],[50,1,50,2],[50,3,50,4],[50,5,50,6],[50,7,50,8],[50,9,50,10],[51,1,51,2],[51,3,51,4],[51,5,51,6],[51,7,51,8],[51,9,51,10],[52,1,52,2],[52,3,52,4],[52,5,52,6],[52,7,52,8],[52,9,52,10],[53,1,53,2],[53,3,53,4],[53,5,53,6],[53,7,53,8],[53,9,53,10],[54,1,54,2],[54,3,54,4],[54,5,54,6],[54,7,54,8],[54,9,54,10],[55,1,55,2],[55,3,55,4],[55,5,55,6],[55,7,55,8],[55,9,55,10],[58,0,58,10],[59,1,59,3],[59,9,59,10],[60,0,60,1],[60,2,60,4],[60,5,60,10],[56,1,56,2],[56,3,56,10],[57,0,57,10],[59,5,59,8],[65,0,65,1],[65,4,65,10],[66,0,66,1],[66,2,66,3],[66,5,66,10],[67,0,67,10],[61,2,61,6],[61,7,61,10],[62,0,62,10],[63,0,63,10],[64,0,64,1],[64,2,64,3],[64,4,64,10],[65,2,65,3],[68,0,68,10],[69,0,69,4],[69,5,69,6],[69,7,72,8],[69,9,82,10],[70,0,70,4],[70,5,70,6],[71,0,71,4],[71,5,71,6],[72,0,72,4],[77,5,77,6],[78,0,78,4],[78,5,79,6],[78,7,78,8],[79,0,79,4],[80,0,80,1],[80,2,80,4],[80,5,80,6],[72,5,72,6],[73,0,73,4],[73,5,76,6],[73,7,73,8],[74,0,74,4],[74,7,77,8],[75,0,75,2],[75,3,75,4],[76,0,76,2],[77,0,77,2],[81,0,81,1],[81,2,81,4],[81,5,81,6],[82,0,82,4],[82,5,90,6],[82,7,82,8],[83,0,83,4],[83,7,86,8],[88,0,88,4],[88,7,90,8],[88,9,88,10],[89,0,89,4],[89,9,90,10],[90,0,90,4],[96,5,96,6],[97,5,97,6],[104,7,104,8],[98,5,98,6],[99,5,99,6],[92,5,92,6],[91,0,91,4],[91,5,91,6],[91,7,91,8],[94,5,94,6],[95,5,95,6],[99,3,99,4],[100,3,100,4],[101,3,101,4],[102,3,102,4],[103,3,103,4],[93,3,93,4],[92,2,104,2],[91,9,91,10],[83,9,83,10],[84,0,84,4],[84,9,87,10],[85,0,85,3],[86,0,86,3],[87,0,87,3],[87,7,87,8],[106,9,106,10],[92,0,106,0],[104,3,104,4],[92,3,92,4],[94,3,94,4],[95,3,95,4],[96,3,96,4],[97,3,97,4],[104,9,104,10],[101,5,101,6],[102,5,102,6],[105,1,105,4],[105,9,105,10],[106,5,106,6],[106,7,106,8],[104,5,104,6],[107,7,107,9],[108,0,108,10],[110,5,110,6],[113,5,113,6],[113,7,113,8],[110,7,110,8],[111,5,111,6],[111,7,111,8],[112,5,112,6],[112,7,112,8],[109,0,109,4],[109,5,109,6],[109,7,109,8],[110,9,117,10],[131,9,131,10],[132,0,132,1],[132,2,132,4],[132,5,132,10],[123,5,123,6],[123,7,123,8],[123,9,123,10],[124,0,124,4],[124,5,124,6],[124,7,124,8],[124,9,124,10],[125,0,125,4],[125,5,125,6],[125,7,125,8],[125,9,125,10],[131,1,131,3],[129,0,129,4],[128,0,128,8],[121,9,121,10],[122,0,122,4],[122,9,122,10],[123,0,123,4],[122,7,122,8],[118,9,118,10],[119,0,119,4],[109,9,109,10],[117,5,117,6],[110,1,110,4],[111,1,111,4],[112,1,112,4],[113,1,113,4],[119,9,119,10],[120,5,120,6],[117,7,117,8],[115,5,115,6],[120,9,120,10],[120,7,120,8],[137,0,137,1],[137,2,137,3],[137,5,137,10],[136,0,136,1],[136,4,136,10],[126,5,126,6],[126,7,126,8],[126,9,126,10],[127,0,127,4],[127,5,127,6],[127,7,127,8],[127,9,127,10],[134,0,134,10],[128,9,128,10],[129,9,129,10],[126,0,126,4],[130,0,130,10],[136,2,136,3],[135,0,135,1],[135,2,135,3],[135,4,135,10],[133,2,133,4],[133,5,133,10],[131,5,131,8]]}
["FORM NO. 16"]
["[(See Rule 31(1)(a)]"]
["PART-A"]
["Certificate under section 203 of the income-tax act, 1961 for Tax deducted at source on Salary."]
["Name and address of the Employer",null,null,null,null,"Name and adress of the Employee"]
[{"$f":"ENTRY!J14","v":"ALTAF AHAMAD KHAN"},null,null,null,null,{"$f":"COMPUTATION!E3","v":"VIJAY"}]
[{"$f":"ENTRY!J12","v":"AMARPURA"},null,null,null,null,{"$f":"COMPUTATION!J3","v":" TEACHER"}]
["PAN of the Deductor",null,null,"TAN of  the Deductor",null,"PAN of the Employee",null,null,"Employee Ref No."]
{"$rows_left_out":131}
{"sheet":"89(1)form","index":8,"n_rows":16,"n_cols":21,"rows_kept":16,"cut":false,"hidden":false,"merged":[[4,0,4,10],[5,0,5,10],[4,11,4,13],[15,3,15,6],[10,0,10,2],[11,0,11,2],[12,3,12,6],[13,3,13,6],[14,3,14,6],[12,0,12,2],[13,0,13,2],[14,0,14,2],[6,0,9,2],[15,11,15,13],[6,11,9,13],[15,7,15,10],[0,20,0,26],[1,20,6,26],[0,0,0,13],[0,16,1,19],[1,0,1,2],[1,3,1,13],[2,0,2,2],[2,3,2,13],[3,16,5,19],[3,0,3,2],[3,3,3,6],[3,7,3,10],[3,11,3,13],[5,11,5,13],[6,3,9,6],[6,7,9,10],[15,0,15,2],[10,3,10,6],[11,3,11,6],[8,16,10,19],[10,11,10,13],[11,11,11,13],[12,11,12,13],[13,11,13,13],[12,16,14,19],[14,11,14,13],[12,7,12,10],[13,7,13,10],[14,7,14,10],[10,7,10,10],[11,7,11,10]]}
["CALCULATION OF SALARY ARREAR RELIEF UNDER SECTION 89 (1)",null,null,null,null,null,null,null,null,null,null,null,null,null,null,null,"1- loZizFke vius ,fj;j dks xr foÙkh; o\"kksZa ds vuqlkj foHkkftr djsaA",null,null,null,"धारा US 89 की छूट का नियम "]
["NAME",null,null,{"$f":"COMPUTATION!E3","v":"VIJAY"},null,null,null,null,null,null,null,null,null,null,null,null,null,null,null,null,"           यदि कर्मचारी को गत वर्ष का कोई एरियर इस वर्ष मेँ प्राप्त हुआ है तो वह गत वर्ष में कर योग्य होगा बर्शते वह राशि उपार्जित होने वाले वर्ष में पहले ही कर योग्य न की गई हो तो एरियर पर धारा 89 की छूट का दावा किया जा सकता है I"]
["ADDRESS",null,null,{"$f":"ENTRY!C11","v":" GOVT SECONDARY SCHOOLDHANERU (BIKANER)"}]
["PAN",null,null,{"$f":"'16 NO.'!F9","v":"EFNPS7790B"},null,null,null,"CATEGORY",null,null,null,"Indian Resident",null,null,null,null,"2- vc lEcfU/kr foÙkh; o\"kksZa ds QkWeZ 16 vFkok ITR ls dj ;ksX; vk; dks lEcfU/kr lsYl esa Hkjuk gSA"]
["Total Taxable Income including Arrear Received in FY 2017-18",null,null,null,null,null,null,null,null,null,null,{"$f":"COMPUTATION!M40","v":606920}]
[" Year-wise Breakup of Arrears received and taxable income "]
["Financial Year",null,null,"Taxable Income of the relevant F.Y. without the arrears or advance (Rs.)",null,null,null,"Amount of Arrears or Advance  received against each Financial Year (Rs.)",null,null,null,"Total Taxable Income of the relevant F.Y. with the arrears or advance (Rs.)"]
[]
{"$rows_left_out":9}
{"sheet":"Form10E","index":9,"n_rows":48,"n_cols":13,"rows_kept":48,"cut":false,"hidden":false,"merged":[[38,0,38,7],[35,0,35,1],[35,2,35,3],[35,4,35,5],[35,6,35,7],[35,8,35,9],[34,12,34,13],[36,0,36,1],[36,2,36,3],[36,4,36,5],[36,6,36,7],[36,8,36,9],[36,10,36,11],[36,12,36,13],[35,10,35,11],[35,12,35,13],[34,0,34,1],[34,2,34,3],[34,4,34,5],[34,6,34,7],[34,8,34,9],[34,10,34,11],[32,12,32,13],[33,0,33,1],[33,2,33,3],[33,4,33,5],[33,6,33,7],[33,8,33,9],[33,10,33,11],[33,12,33,13],[32,0,32,1],[32,2,32,3],[32,4,32,5],[32,6,32,7],[32,8,32,9],[32,10,32,11],[29,0,29,1],[29,2,29,3],[29,4,29,5],[29,6,29,7],[29,8,29,9],[29,10,29,11],[29,12,29,13],[30,12,30,13],[31,0,31,1],[31,2,31,3],[31,4,31,5],[31,6,31,7],[31,8,31,9],[31,10,31,11],[31,12,31,13],[30,0,30,1],[30,2,30,3],[30,4,30,5],[30,6,30,7],[30,8,30,9],[30,10,30,11],[20,0,20,10],[20,11,20,13],[21,0,21,10],[21,11,21,13],[22,0,22,10],[22,11,22,13],[26,0,26,10],[26,11,26,13],[28,0,28,13],[0,0,0,13],[1,0,1,13],[2,0,2,2],[2,3,2,13],[12,0,12,13],[13,0,13,13],[16,10,16,13],[18,0,18,13],[19,0,19,10],[19,11,19,13],[9,0,9,10],[9,11,9,13],[10,0,10,10],[10,11,10,13],[11,0,11,10],[11,11,11,13],[15,1,15,2],[43,0,43,1],[44,0,44,1],[45,6,45,7],[3,0,3,2],[3,3,3,13],[4,0,4,2],[4,3,4,7],[4,8,4,9],[40,0,40,1],[41,0,41,1],[42,0,42,1],[4,10,4,13],[5,0,5,13],[6,0,6,13],[7,0,7,10],[7,11,7,13],[8,0,8,10],[8,11,8,13],[23,0,23,10],[23,11,23,13],[24,0,24,10],[24,11,24,13],[25,0,25,10],[25,11,25,13]]}
["FORM NO. 10 E (See rule 21AA)"]
["Form for furnishing particulars of income undr scetion 192(2A) for year ending 31st March 2018 for claiming relief under section 89(1) by a Government servant or an employee in a company, co-operative society, local authority, university, institution, association or body."]
["Name",null,null,{"$f":"PROPER(IF('89(1)form'!D2=\"\",\"\",'89(1)form'!D2))","v":"Vijay"}]
["Address",null,null,{"$f":"PROPER(IF('89(1)form'!D3=\"\",\"\",'89(1)form'!D3))","v":" Govt Secondary Schooldhaneru (Bikaner)"}]
["PAN",null,null,{"$f":"UPPER(IF('89(1)form'!D4=\"\",\"\",'89(1)form'!D4))","v":"EFNPS7790B"},null,null,null,null,"Status",null,"Indian Resident "]
[]
["Particulars of Income referred to in rule 21A of the Income tax Rules, 1962, during the previous year relevant to assessment year 2018-19"]
["1. (a) Salary received in arrears or in advance during 2017-18 in accordance with the provision of sub-rule (2) of rule 21A",null,null,null,null,null,null,null,null,null,null,{"$f":"'89(1)form'!H16","v":0}]
{"$rows_left_out":40}