{"text_format":"1","workbook":"xlsx","n_sheets":4,"sheets":["how to use","teacher-wise time-table","slips for individual teachers","class-wise time table"],"not_rendered":{"charts":0,"images":0,"macros":1,"external_links":0,"defined_names":0,"comments":0,"pivot_tables":0},"unopened":[],"bounds":{"document_bytes":16777216,"sheet_cells":100000,"rows_first":2000,"rows_last":500,"rows_between":2000,"halvings":0,"cell_chars":16384,"cell_head_chars":4096},"cells_cut":0,"cells_raw":0,"read":"whole","date_system":"1900"}

{"sheet":"how to use","index":0,"n_rows":10,"n_cols":2,"rows_kept":10,"cut":false,"hidden":false,"merged":[]}
[null,"This is a macro-embedded workbook. Save it in the xlsm format only. Enable macros before starting to work."]
[null,"This workbook helps to get class-wise time table and  the individual teacher-wise time table slips if you set the teacher-wise time table."]
[null,"Set your time-table in the sheet named 'teacher-wise time-table' and get the slips from the sheet 'slips for individual teachers'"]
[null,"To get the class-wise-time table, go to the sheet 'class-wise time-table' and click the button 'GENERATE CLASS-WISE TIME-TABLE'"]
[null,"Do not delete or insert any rows or columns in any of the sheets."]
[null,"Make any changes that you like in any cell except column A in the sheet 'teacher-wise time-table. Do not make any changes in any other sheet. "]
[null,"Write the names of the teachers on in column A. The sheet will automatically carry those names where ever necessary."]
[null,"You can increase or decrease the row or column size. "]
{"$rows_left_out":3}
{"sheet":"teacher-wise time-table","index":1,"n_rows":106,"n_cols":15,"rows_kept":106,"cut":false,"hidden":false,"merged":[[5,8,8,8],[103,2,105,2],[103,3,105,3],[1,14,3,14],[1,13,3,13],[49,3,51,3],[1,8,3,8],[52,13,54,13],[34,13,36,13],[37,13,39,13],[49,13,51,13],[46,13,48,13],[46,3,48,3],[40,13,42,13],[43,13,45,13],[40,3,42,3],[43,3,45,3],[16,13,18,13],[16,14,18,14],[28,13,30,13],[31,13,33,13],[19,13,21,13],[19,14,21,14],[22,13,24,13],[22,14,24,14],[25,13,27,13],[25,14,27,14],[103,14,105,14],[0,1,0,14],[4,13,6,13],[4,14,6,14],[7,13,9,13],[7,14,9,14],[4,3,6,3],[10,8,13,8],[4,2,6,2],[7,2,9,2],[10,2,12,2],[13,2,15,2],[1,2,3,2],[7,3,9,3],[10,3,12,3],[13,3,15,3],[10,13,12,13],[10,14,12,14],[13,13,15,13],[13,14,15,14],[34,2,36,2],[70,2,72,2],[37,2,39,2],[40,2,42,2],[43,2,45,2],[46,2,48,2],[49,2,51,2],[52,2,54,2],[52,3,54,3],[16,2,18,2],[37,3,39,3],[34,3,36,3],[28,3,30,3],[31,3,33,3],[28,2,30,2],[31,2,33,2],[25,3,27,3],[16,3,18,3],[19,3,21,3],[22,3,24,3],[19,2,21,2],[22,2,24,2],[25,2,27,2],[91,2,93,2],[73,2,75,2],[76,2,78,2],[79,2,81,2],[55,2,57,2],[55,3,57,3],[55,13,57,13],[55,14,57,14],[58,2,60,2],[58,3,60,3],[58,13,60,13],[58,14,60,14],[61,2,63,2],[61,3,63,3],[61,13,63,13],[61,14,63,14],[64,2,66,2],[64,3,66,3],[64,13,66,13],[64,14,66,14],[67,2,69,2],[67,3,69,3],[67,13,69,13],[67,14,69,14],[79,13,81,13],[70,3,72,3],[70,13,72,13],[70,14,72,14],[97,14,99,14],[100,14,102,14],[82,2,84,2],[82,3,84,3],[82,13,84,13],[85,2,87,2],[85,3,87,3],[85,13,87,13],[85,14,87,14],[88,2,90,2],[88,3,90,3],[88,13,90,13],[88,14,90,14],[82,14,84,14],[97,2,99,2],[97,3,99,3],[97,13,99,13],[100,2,102,2],[100,3,102,3],[100,13,102,13],[79,14,81,14],[91,3,93,3],[91,13,93,13],[94,2,96,2],[94,3,96,3],[94,13,96,13],[49,14,51,14],[52,14,54,14],[28,14,30,14],[31,14,33,14],[34,14,36,14],[37,14,39,14],[40,14,42,14],[43,14,45,14],[46,14,48,14],[91,14,93,14],[94,14,96,14],[73,3,75,3],[73,13,75,13],[73,14,75,14],[76,3,78,3],[76,13,78,13],[76,14,78,14],[79,3,81,3]]}
[null,"GOVT. GIRLS' HR. SEC. SCHOOL, NIMBAHERA,                                                  TEACHER-WISE TIME TABLE FOR THE YEAR 2014-15"]
[null,"PRAYER","POST + RESPONSI-BILITIES","PERIOD",1,2,3,4," BREAK      ",5,6,7,8,"TTL PERIODS PER WEEK","SIGNATURE"]
[null,"7:00-7:20",null,"SUMMER TIMINGS","07:20-07:55","07:55-08:30","08:30-09:05","09:05-09:40",null,"10:10-10:45","10:45-11:20","11:20-11:55","11:55-12:25"]
[null,"7:30-7:50",null,"WINTER TIMINGS","07:50-08:25","08:25-08:55","08:55-09:25","09:25-09:55",null,"10:25-10:55","10:55-11:25","11:25-11:55","11:55-12:25"]
[1,"MR. A",{"$f":"CONCATENATE(B6,\", \",B7)","v":"LECTURER, BIOLOGY "},"OFFICIATING OFFICER",null,"11th D","12th D ",null,null,"12th D BIO. PR.","12th D BIO. PR.","11th D BIO. PR.","11th D BIO. PR.",28]
[2,"LECTURER",null,null,null,"BIOLOGY 1 TO 6","BIOLOGY 1 TO 6",null,"09:40-10:10         "," D1 1,2  D2 3,4"," D1 1,2  D2 3,4"," D1 3,4  D2 5,6"," D1 3,4  D2 5,6"]
[3,"BIOLOGY ",null,null,{"$f":"IF(OR($B5=\"\",E5=\"\"),\"\",$B5)","v":""},{"$f":"IF(OR($B5=\"\",F5=\"\"),\"\",$B5)","v":"MR. A"},{"$f":"IF(OR($B5=\"\",G5=\"\"),\"\",$B5)","v":"MR. A"},{"$f":"IF(OR($B5=\"\",H5=\"\"),\"\",$B5)","v":""},null,{"$f":"IF(OR($B5=\"\",J5=\"\"),\"\",$B5)","v":"MR. A"},{"$f":"IF(OR($B5=\"\",K5=\"\"),\"\",$B5)","v":"MR. A"},{"$f":"IF(OR($B5=\"\",L5=\"\"),\"\",$B5)","v":"MR. A"},{"$f":"IF(OR($B5=\"\",M5=\"\"),\"\",$B5)","v":"MR. A"}]
[4,"MR. B",{"$f":"CONCATENATE(B9,\", \",B10)","v":"LECTURER , CHEMISTRY"},"CT 12 D, NSS, SCIENCE CLUB              CT 12 D","12th D",null,"11th D","12th D ",null,"12th D CHEM. PR.","12th D CHEM. PR.","11th D CHEM . PR.","11th D CHEM . PR.",32]
{"$rows_left_out":99}
{"sheet":"slips for individual teachers","index":2,"n_rows":510,"n_cols":5,"rows_kept":510,"cut":false,"hidden":false,"merged":[[465,0,466,3],[465,4,466,4],[467,0,468,0],[467,1,468,1],[467,2,468,2],[467,3,468,3],[467,4,468,4],[469,3,469,4],[479,0,479,2],[450,0,451,3],[450,4,451,4],[452,0,453,0],[452,1,453,1],[452,2,453,2],[452,3,453,3],[452,4,453,4],[454,3,454,4],[464,0,464,2],[435,0,436,3],[435,4,436,4],[437,0,438,0],[437,1,438,1],[437,2,438,2],[437,3,438,3],[437,4,438,4],[439,3,439,4],[449,0,449,2],[420,0,421,3],[420,4,421,4],[422,0,423,0],[422,1,423,1],[422,2,423,2],[422,3,423,3],[422,4,423,4],[424,3,424,4],[434,0,434,2],[405,0,406,3],[405,4,406,4],[407,0,408,0],[407,1,408,1],[407,2,408,2],[407,3,408,3],[407,4,408,4],[409,3,409,4],[419,0,419,2],[390,0,391,3],[390,4,391,4],[392,0,393,0],[392,1,393,1],[392,2,393,2],[392,3,393,3],[392,4,393,4],[394,3,394,4],[404,0,404,2],[375,0,376,3],[375,4,376,4],[377,0,378,0],[377,1,378,1],[377,2,378,2],[377,3,378,3],[377,4,378,4],[379,3,379,4],[389,0,389,2],[360,0,361,3],[360,4,361,4],[362,0,363,0],[362,1,363,1],[362,2,363,2],[362,3,363,3],[362,4,363,4],[364,3,364,4],[374,0,374,2],[345,0,346,3],[345,4,346,4],[347,0,348,0],[347,1,348,1],[347,2,348,2],[347,3,348,3],[347,4,348,4],[349,3,349,4],[359,0,359,2],[330,0,331,3],[330,4,331,4],[332,0,333,0],[332,1,333,1],[332,2,333,2],[332,3,333,3],[332,4,333,4],[334,3,334,4],[344,0,344,2],[315,0,316,3],[315,4,316,4],[317,0,318,0],[317,1,318,1],[317,2,318,2],[317,3,318,3],[317,4,318,4],[319,3,319,4],[329,0,329,2],[300,0,301,3],[300,4,301,4],[302,0,303,0],[302,1,303,1],[302,2,303,2],[302,3,303,3],[302,4,303,4],[304,3,304,4],[314,0,314,2],[285,0,286,3],[285,4,286,4],[287,0,288,0],[287,1,288,1],[287,2,288,2],[287,3,288,3],[287,4,288,4],[289,3,289,4],[299,0,299,2],[270,0,271,3],[270,4,271,4],[272,0,273,0],[272,1,273,1],[272,2,273,2],[272,3,273,3],[272,4,273,4],[274,3,274,4],[284,0,284,2],[0,0,1,3],[0,4,1,4],[2,0,3,0],[2,1,3,1],[2,2,3,2],[2,3,3,3],[2,4,3,4],[4,3,4,4],[14,0,14,2],[255,0,256,3],[255,4,256,4],[257,0,258,0],[257,1,258,1],[257,2,258,2],[257,3,258,3],[257,4,258,4],[259,3,259,4],[269,0,269,2],[240,0,241,3],[240,4,241,4],[242,0,243,0],[242,1,243,1],[242,2,243,2],[242,3,243,3],[242,4,243,4],[244,3,244,4],[254,0,254,2],[225,0,226,3],[225,4,226,4],[227,0,228,0],[227,1,228,1],[227,2,228,2],[227,3,228,3],[227,4,228,4],[229,3,229,4],[239,0,239,2],[210,0,211,3],[210,4,211,4],[212,0,213,0],[212,1,213,1],[212,2,213,2],[212,3,213,3],[212,4,213,4],[214,3,214,4],[224,0,224,2],[195,0,196,3],[195,4,196,4],[197,0,198,0],[197,1,198,1],[197,2,198,2],[197,3,198,3],[197,4,198,4],[199,3,199,4],[209,0,209,2],[180,0,181,3],[180,4,181,4],[182,0,183,0],[182,1,183,1],[182,2,183,2],[182,3,183,3],[182,4,183,4],[184,3,184,4],[194,0,194,2],[165,0,166,3],[165,4,166,4],[167,0,168,0],[167,1,168,1],[167,2,168,2],[167,3,168,3],[167,4,168,4],[169,3,169,4],[179,0,179,2],[150,0,151,3],[150,4,151,4],[152,0,153,0],[152,1,153,1],[152,2,153,2],[152,3,153,3],[152,4,153,4],[154,3,154,4],[164,0,164,2],[135,0,136,3],[135,4,136,4],[137,0,138,0],[137,1,138,1],[137,2,138,2],[137,3,138,3],[137,4,138,4],[139,3,139,4],[149,0,149,2],[120,0,121,3],[120,4,121,4],[122,0,123,0],[122,1,123,1],[122,2,123,2],[122,3,123,3],[122,4,123,4],[124,3,124,4],[134,0,134,2],[105,0,106,3],[105,4,106,4],[107,0,108,0],[107,1,108,1],[107,2,108,2],[107,3,108,3],[107,4,108,4],[109,3,109,4],[119,0,119,2],[90,0,91,3],[90,4,91,4],[92,0,93,0],[92,1,93,1],[92,2,93,2],[92,3,93,3],[92,4,93,4],[94,3,94,4],[104,0,104,2],[75,0,76,3],[75,4,76,4],[77,0,78,0],[77,1,78,1],[77,2,78,2],[77,3,78,3],[77,4,78,4],[79,3,79,4],[89,0,89,2],[60,0,61,3],[60,4,61,4],[62,0,63,0],[62,1,63,1],[62,2,63,2],[62,3,63,3],[62,4,63,4],[64,3,64,4],[74,0,74,2],[45,0,46,3],[45,4,46,4],[47,0,48,0],[47,1,48,1],[47,2,48,2],[47,3,48,3],[47,4,48,4],[49,3,49,4],[59,0,59,2],[30,0,31,3],[30,4,31,4],[32,0,33,0],[32,1,33,1],[32,2,33,2],[32,3,33,3],[32,4,33,4],[34,3,34,4],[44,0,44,2],[15,0,16,3],[15,4,16,4],[17,0,18,0],[17,1,18,1],[17,2,18,2],[17,3,18,3],[17,4,18,4],[19,3,19,4],[29,0,29,2],[480,0,481,3],[480,4,481,4],[482,0,483,0],[482,1,483,1],[482,2,483,2],[482,3,483,3],[482,4,483,4],[484,3,484,4],[494,0,494,2],[495,0,496,3],[495,4,496,4],[497,0,498,0],[497,1,498,1],[497,2,498,2],[497,3,498,3],[497,4,498,4],[499,3,499,4],[509,0,509,2]]}
[{"$f":"'teacher-wise time-table'!$B$1","v":"GOVT. GIRLS' HR. SEC. SCHOOL, NIMBAHERA,                                                  TEACHER-WISE TIME TABLE FOR THE YEAR 2014-15"},null,null,null,1]
[]
[{"$f":"'teacher-wise time-table'!$D$3","v":"SUMMER TIMINGS"},{"$f":"'teacher-wise time-table'!$D$4","v":"WINTER TIMINGS"},{"$f":"'teacher-wise time-table'!$D$2","v":"PERIOD"},{"$f":"VLOOKUP(E1,'teacher-wise time-table'!$A$5:$N$106,2)","v":"MR. A"},{"$f":"VLOOKUP(E1,'teacher-wise time-table'!$A$5:$N$106,3)","v":"LECTURER, BIOLOGY "}]
[]
[{"$f":"'teacher-wise time-table'!$B$3","v":"7:00-7:20"},{"$f":"'teacher-wise time-table'!$B$4","v":"7:30-7:50"},{"$f":"'teacher-wise time-table'!$B$2","v":"PRAYER"},{"$f":"VLOOKUP(E1,'teacher-wise time-table'!$A$5:$N$106,4)","v":"OFFICIATING OFFICER"}]
[{"$f":"'teacher-wise time-table'!$E$3","v":"07:20-07:55"},{"$f":"'teacher-wise time-table'!$E$4","v":"07:50-08:25"},{"$f":"'teacher-wise time-table'!$E$2","v":1},{"$f":"VLOOKUP(E1,'teacher-wise time-table'!$A$5:$N$106,5)","v":0},{"$f":"VLOOKUP(E1+1,'teacher-wise time-table'!$A$5:$N$106,5)","v":0}]
[{"$f":"'teacher-wise time-table'!$F$3","v":"07:55-08:30"},{"$f":"'teacher-wise time-table'!$F$4","v":"08:25-08:55"},{"$f":"'teacher-wise time-table'!$F$2","v":2},{"$f":"VLOOKUP(E1,'teacher-wise time-table'!$A$5:$N$106,6)","v":"11th D"},{"$f":"VLOOKUP(E1+1,'teacher-wise time-table'!$A$5:$N$106,6)","v":"BIOLOGY 1 TO 6"}]
[{"$f":"'teacher-wise time-table'!$G$3","v":"08:30-09:05"},{"$f":"'teacher-wise time-table'!$G$4","v":"08:55-09:25"},{"$f":"'teacher-wise time-table'!$G$2","v":3},{"$f":"VLOOKUP(E1,'teacher-wise time-table'!$A$5:$N$106,7)","v":"12th D "},{"$f":"VLOOKUP(E1+1,'teacher-wise time-table'!$A$5:$N$106,7)","v":"BIOLOGY 1 TO 6"}]
{"$rows_left_out":503}
{"sheet":"class-wise time table","index":3,"n_rows":106,"n_cols":13,"rows_kept":106,"cut":false,"hidden":false,"merged":[[0,0,2,0],[0,6,0,12],[0,4,0,5]]}
[null,{"$f":"'teacher-wise time-table'!B1","v":"GOVT. GIRLS' HR. SEC. SCHOOL, NIMBAHERA,                                                  TEACHER-WISE TIME TABLE FOR THE YEAR 2014-15"},null,null,null,null,{"$f":"'teacher-wise time-table'!B1","v":"GOVT. GIRLS' HR. SEC. SCHOOL, NIMBAHERA,                                                  TEACHER-WISE TIME TABLE FOR THE YEAR 2014-15"}]
[null,{"$f":"'teacher-wise time-table'!B3","v":"7:00-7:20"},{"$f":"'teacher-wise time-table'!C3","v":0},{"$f":"'teacher-wise time-table'!D3","v":"SUMMER TIMINGS"},{"$f":"'teacher-wise time-table'!E3","v":"07:20-07:55"},{"$f":"'teacher-wise time-table'!F3","v":"07:55-08:30"},{"$f":"'teacher-wise time-table'!G3","v":"08:30-09:05"},{"$f":"'teacher-wise time-table'!H3","v":"09:05-09:40"},{"$f":"'teacher-wise time-table'!I6","v":"09:40-10:10         "},{"$f":"'teacher-wise time-table'!J3","v":"10:10-10:45"},{"$f":"'teacher-wise time-table'!K3","v":"10:45-11:20"},{"$f":"'teacher-wise time-table'!L3","v":"11:20-11:55"},{"$f":"'teacher-wise time-table'!M3","v":"11:55-12:25"}]
[null,{"$f":"'teacher-wise time-table'!B4","v":"7:30-7:50"},{"$f":"'teacher-wise time-table'!C4","v":0},{"$f":"'teacher-wise time-table'!D4","v":"WINTER TIMINGS"},{"$f":"'teacher-wise time-table'!E4","v":"07:50-08:25"},{"$f":"'teacher-wise time-table'!F4","v":"08:25-08:55"},{"$f":"'teacher-wise time-table'!G4","v":"08:55-09:25"},{"$f":"'teacher-wise time-table'!H4","v":"09:25-09:55"},{"$f":"'teacher-wise time-table'!I11","v":"09:55-10:25"},{"$f":"'teacher-wise time-table'!J4","v":"10:25-10:55"},{"$f":"'teacher-wise time-table'!K4","v":"10:55-11:25"},{"$f":"'teacher-wise time-table'!L4","v":"11:25-11:55"},{"$f":"'teacher-wise time-table'!M4","v":"11:55-12:25"}]
[null,{"$f":"'teacher-wise time-table'!B2","v":"PRAYER"},{"$f":"'teacher-wise time-table'!C2","v":"POST + RESPONSI-BILITIES"},{"$f":"'teacher-wise time-table'!D2","v":"PERIOD"},{"$f":"'teacher-wise time-table'!E2","v":1},{"$f":"'teacher-wise time-table'!F2","v":2},{"$f":"'teacher-wise time-table'!G2","v":3},{"$f":"'teacher-wise time-table'!H2","v":4},{"$f":"'teacher-wise time-table'!I2","v":" BREAK      "},{"$f":"'teacher-wise time-table'!J2","v":5},{"$f":"'teacher-wise time-table'!K2","v":6},{"$f":"'teacher-wise time-table'!L2","v":7},{"$f":"'teacher-wise time-table'!M2","v":8}]
[{"$f":"'teacher-wise time-table'!A5","v":1},{"$f":"IF('teacher-wise time-table'!B5=\"\",\"\",CONCATENATE('teacher-wise time-table'!B5,\", \",'teacher-wise time-table'!B6,\", \",'teacher-wise time-table'!B7))","v":"MR. A, LECTURER, BIOLOGY "},{"$f":"IF('teacher-wise time-table'!C5=\"\",\"\",CONCATENATE('teacher-wise time-table'!C5,\", \",'teacher-wise time-table'!C6,\", \",'teacher-wise time-table'!C7))","v":"LECTURER, BIOLOGY , , "},{"$f":"IF('teacher-wise time-table'!D5=\"\",\"\",CONCATENATE('teacher-wise time-table'!D5,\", \",'teacher-wise time-table'!D6,\", \",'teacher-wise time-table'!D7))","v":"OFFICIATING OFFICER, , "},{"$f":"IF('teacher-wise time-table'!E23=\"\",\"\",CONCATENATE('teacher-wise time-table'!E23,\", \",'teacher-wise time-table'!E24,\", \",'teacher-wise time-table'!E25))","v":"12th E+A,  HINDI COM. 1 TO 6, MR. F"},{"$f":"IF('teacher-wise time-table'!F41=\"\",\"\",CONCATENATE('teacher-wise time-table'!F41,\", \",'teacher-wise time-table'!F42,\", \",'teacher-wise time-table'!F43))","v":"12th E, GEOGRAPHY 1 to 6, VACANT POST 2"},{"$f":"IF('teacher-wise time-table'!G23=\"\",\"\",CONCATENATE('teacher-wise time-table'!G23,\", \",'teacher-wise time-table'!G24,\", \",'teacher-wise time-table'!G25))","v":"12th E, HINDI LIT. 1 TO 6, MR. F"},{"$f":"IF('teacher-wise time-table'!H35=\"\",\"\",CONCATENATE('teacher-wise time-table'!H35,\", \",'teacher-wise time-table'!H36,\", \",'teacher-wise time-table'!H37))","v":"12th E, HOME SC. 1 TO 6, MR. J"},null,{"$f":"IF('teacher-wise time-table'!J14=\"\",\"\",CONCATENATE('teacher-wise time-table'!J14,\", \",'teacher-wise time-table'!J15,\", \",'teacher-wise time-table'!J16))","v":"12th E , ENGLISH 1 TO 6, MR. C"},{"$f":"IF('teacher-wise time-table'!K41=\"\",\"\",CONCATENATE('teacher-wise time-table'!K41,\", \",'teacher-wise time-table'!K42,\", \",'teacher-wise time-table'!K43))","v":"12th E , GEOGRAPHY 1, 3 TO 6, VACANT POST 2"},{"$f":"IF('teacher-wise time-table'!L35=\"\",\"\",CONCATENATE('teacher-wise time-table'!L35,\", \",'teacher-wise time-table'!L36,\", \",'teacher-wise time-table'!L37))","v":"12th E+A , HOME  SC.1,2,4-6 , MR. J"},{"$f":"IF('teacher-wise time-table'!M20=\"\",\"\",CONCATENATE('teacher-wise time-table'!M20,\", \",'teacher-wise time-table'!M21,\", \",'teacher-wise time-table'!M22))","v":"12th E+A, HINDI LIT.1-3,5,6, MR. E"}]
[{"$f":"'teacher-wise time-table'!A6","v":2},null,null,null,{"$f":"IF('teacher-wise time-table'!E8=\"\",\"\",CONCATENATE('teacher-wise time-table'!E8,\", \",'teacher-wise time-table'!E9,\", \",'teacher-wise time-table'!E10))","v":"12th D, CHEMISTRY 1 TO 6, MR. B"},{"$f":"IF('teacher-wise time-table'!F11=\"\",\"\",CONCATENATE('teacher-wise time-table'!F11,\", \",'teacher-wise time-table'!F12,\", \",'teacher-wise time-table'!F13))","v":"12th D, PHYSICS 1 TO 6, VACANT POST 1"},{"$f":"IF('teacher-wise time-table'!G5=\"\",\"\",CONCATENATE('teacher-wise time-table'!G5,\", \",'teacher-wise time-table'!G6,\", \",'teacher-wise time-table'!G7))","v":"12th D , BIOLOGY 1 TO 6, MR. A"},{"$f":"IF('teacher-wise time-table'!H8=\"\",\"\",CONCATENATE('teacher-wise time-table'!H8,\", \",'teacher-wise time-table'!H9,\", \",'teacher-wise time-table'!H10))","v":"12th D , RAJ STD. 1-3 CH 4, MR. B"},null,{"$f":"IF('teacher-wise time-table'!J11=\"\",\"\",CONCATENATE('teacher-wise time-table'!J11,\", \",'teacher-wise time-table'!J12,\", \",'teacher-wise time-table'!J13))","v":"12th D PHY. PR.,  D1 5,6  D2 1,2, VACANT POST 1"},{"$f":"IF('teacher-wise time-table'!K11=\"\",\"\",CONCATENATE('teacher-wise time-table'!K11,\", \",'teacher-wise time-table'!K12,\", \",'teacher-wise time-table'!K13))","v":"12th D PHY. PR.,  D1 5,6  D2 1,2, VACANT POST 1"},{"$f":"IF('teacher-wise time-table'!L14=\"\",\"\",CONCATENATE('teacher-wise time-table'!L14,\", \",'teacher-wise time-table'!L15,\", \",'teacher-wise time-table'!L16))","v":"12th D , ENGLISH 1 TO 6, MR. C"},{"$f":"IF('teacher-wise time-table'!M23=\"\",\"\",CONCATENATE('teacher-wise time-table'!M23,\", \",'teacher-wise time-table'!M24,\", \",'teacher-wise time-table'!M25))","v":"12th D,  HINDI 1 TO 6, MR. F"}]
[{"$f":"'teacher-wise time-table'!A7","v":3},null,null,null,{"$f":"IF('teacher-wise time-table'!E14=\"\",\"\",CONCATENATE('teacher-wise time-table'!E14,\", \",'teacher-wise time-table'!E15,\", \",'teacher-wise time-table'!E16))","v":"12th C, ENGLISH 1 TO 6, MR. C"},{"$f":"IF('teacher-wise time-table'!F26=\"\",\"\",CONCATENATE('teacher-wise time-table'!F26,\", \",'teacher-wise time-table'!F27,\", \",'teacher-wise time-table'!F28))","v":"12th C, HISTORY 1 TO 6, MR. G"},{"$f":"IF('teacher-wise time-table'!G35=\"\",\"\",CONCATENATE('teacher-wise time-table'!G35,\", \",'teacher-wise time-table'!G36,\", \",'teacher-wise time-table'!G37))","v":"12th C+B, HOME. SC. 1-6, MR. J"},{"$f":"IF('teacher-wise time-table'!H11=\"\",\"\",CONCATENATE('teacher-wise time-table'!H11,\", \",'teacher-wise time-table'!H12,\", \",'teacher-wise time-table'!H13))","v":"12th D , PHYSICS 5,6, VACANT POST 1"},null,{"$f":"IF('teacher-wise time-table'!J53=\"\",\"\",CONCATENATE('teacher-wise time-table'!J53,\", \",'teacher-wise time-table'!J54,\", \",'teacher-wise time-table'!J55))","v":"12th D PHY. PR.,  D1 5,6  D2 1,2, MR. N"},{"$f":"IF('teacher-wise time-table'!K53=\"\",\"\",CONCATENATE('teacher-wise time-table'!K53,\", \",'teacher-wise time-table'!K54,\", \",'teacher-wise time-table'!K55))","v":"12th D PHY. PR.,  D1 5,6  D2 1,2, MR. N"},{"$f":"IF('teacher-wise time-table'!L38=\"\",\"\",CONCATENATE('teacher-wise time-table'!L38,\", \",'teacher-wise time-table'!L39,\", \",'teacher-wise time-table'!L40))","v":"12th C , URDU 2-6, MR. K"},{"$f":"IF('teacher-wise time-table'!M35=\"\",\"\",CONCATENATE('teacher-wise time-table'!M35,\", \",'teacher-wise time-table'!M36,\", \",'teacher-wise time-table'!M37))","v":"12th C, HOME. SC. 1,3-6, MR. J"}]
[{"$f":"'teacher-wise time-table'!A8","v":4},{"$f":"IF('teacher-wise time-table'!B8=\"\",\"\",CONCATENATE('teacher-wise time-table'!B8,\", \",'teacher-wise time-table'!B9,\", \",'teacher-wise time-table'!B10))","v":"MR. B, LECTURER , CHEMISTRY"},{"$f":"IF('teacher-wise time-table'!C8=\"\",\"\",CONCATENATE('teacher-wise time-table'!C8,\", \",'teacher-wise time-table'!C9,\", \",'teacher-wise time-table'!C10))","v":"LECTURER , CHEMISTRY, , "},{"$f":"IF('teacher-wise time-table'!D8=\"\",\"\",CONCATENATE('teacher-wise time-table'!D8,\", \",'teacher-wise time-table'!D9,\", \",'teacher-wise time-table'!D10))","v":"CT 12 D, NSS, SCIENCE CLUB              CT 12 D, , "},{"$f":"IF('teacher-wise time-table'!E26=\"\",\"\",CONCATENATE('teacher-wise time-table'!E26,\", \",'teacher-wise time-table'!E27,\", \",'teacher-wise time-table'!E28))","v":"12th B, HISTORY 1 TO 6, MR. G"},{"$f":"IF('teacher-wise time-table'!F14=\"\",\"\",CONCATENATE('teacher-wise time-table'!F14,\", \",'teacher-wise time-table'!F15,\", \",'teacher-wise time-table'!F16))","v":"12th B, ENGLISH 1 TO 6, MR. C"},{"$f":"IF('teacher-wise time-table'!G20=\"\",\"\",CONCATENATE('teacher-wise time-table'!G20,\", \",'teacher-wise time-table'!G21,\", \",'teacher-wise time-table'!G22))","v":"12th A, HINDI LIT. 1 TO 6, MR. E"},{"$f":"IF('teacher-wise time-table'!H20=\"\",\"\",CONCATENATE('teacher-wise time-table'!H20,\", \",'teacher-wise time-table'!H21,\", \",'teacher-wise time-table'!H22))","v":"12th C O,  HINDI COM. 1 TO 6, MR. E"},null,{"$f":"IF('teacher-wise time-table'!J50=\"\",\"\",CONCATENATE('teacher-wise time-table'!J50,\", \",'teacher-wise time-table'!J51,\", \",'teacher-wise time-table'!J52))","v":"12th D CHEM. PR.,  D1 3,4  D2 5,6, MR. M"},{"$f":"IF('teacher-wise time-table'!K8=\"\",\"\",CONCATENATE('teacher-wise time-table'!K8,\", \",'teacher-wise time-table'!K9,\", \",'teacher-wise time-table'!K10))","v":"12th D CHEM. PR.,  D1 3,4  D2 5,6, MR. B"},{"$f":"IF('teacher-wise time-table'!L29=\"\",\"\",CONCATENATE('teacher-wise time-table'!L29,\", \",'teacher-wise time-table'!L30,\", \",'teacher-wise time-table'!L31))","v":"12th B, POL. SC. 2-6, MR. H"},{"$f":"IF('teacher-wise time-table'!M26=\"\",\"\",CONCATENATE('teacher-wise time-table'!M26,\", \",'teacher-wise time-table'!M27,\", \",'teacher-wise time-table'!M28))","v":"12th B, HISTORY 1,3-6, MR. G"}]
{"$rows_left_out":98}