{"text_format":"1","workbook":"xlsx","n_sheets":4,"sheets":["how to use","teacher-wise time-table","slips for individual teachers","class-wise time table"],"not_rendered":{"charts":0,"images":0,"macros":1,"external_links":0,"defined_names":0,"comments":0,"pivot_tables":0},"unopened":[],"bounds":{"document_bytes":16777216,"sheet_cells":100000,"rows_first":2000,"rows_last":500,"rows_between":2000,"halvings":0,"cell_chars":16384,"cell_head_chars":4096},"cells_cut":0,"cells_raw":0,"read":"whole","date_system":"1900"}

{"sheet":"how to use","index":0,"n_rows":10,"n_cols":2,"rows_kept":10,"cut":false,"hidden":false,"merged":[]}
[null,"This is a macro-embedded workbook. Save it in the xlsm format only. Enable macros before starting to work."]
[null,"This workbook helps to get class-wise time table and  the individual teacher-wise time table slips if you set the teacher-wise time table."]
[null,"Set your time-table in the sheet named 'teacher-wise time-table' and get the slips from the sheet 'slips for individual teachers'"]
[null,"To get the class-wise-time table, go to the sheet 'class-wise time-table' and click the button 'GENERATE CLASS-WISE TIME-TABLE'"]
[null,"Do not delete or insert any rows or columns in any of the sheets."]
[null,"Make any changes that you like in any cell except column A in the sheet 'teacher-wise time-table. Do not make any changes in any other sheet. "]
[null,"Write the names of the teachers on in column A. The sheet will automatically carry those names where ever necessary."]
[null,"You can increase or decrease the row or column size. "]
[null,"Do not use 'cut paste' option."]
[null,"In case of any suggestions plz mail to kavita.fadnavis@gmail.com"]

{"sheet":"teacher-wise time-table","index":1,"n_rows":106,"n_cols":15,"rows_kept":106,"cut":false,"hidden":false,"merged":[[5,8,8,8],[103,2,105,2],[103,3,105,3],[1,14,3,14],[1,13,3,13],[49,3,51,3],[1,8,3,8],[52,13,54,13],[34,13,36,13],[37,13,39,13],[49,13,51,13],[46,13,48,13],[46,3,48,3],[40,13,42,13],[43,13,45,13],[40,3,42,3],[43,3,45,3],[16,13,18,13],[16,14,18,14],[28,13,30,13],[31,13,33,13],[19,13,21,13],[19,14,21,14],[22,13,24,13],[22,14,24,14],[25,13,27,13],[25,14,27,14],[103,14,105,14],[0,1,0,14],[4,13,6,13],[4,14,6,14],[7,13,9,13],[7,14,9,14],[4,3,6,3],[10,8,13,8],[4,2,6,2],[7,2,9,2],[10,2,12,2],[13,2,15,2],[1,2,3,2],[7,3,9,3],[10,3,12,3],[13,3,15,3],[10,13,12,13],[10,14,12,14],[13,13,15,13],[13,14,15,14],[34,2,36,2],[70,2,72,2],[37,2,39,2],[40,2,42,2],[43,2,45,2],[46,2,48,2],[49,2,51,2],[52,2,54,2],[52,3,54,3],[16,2,18,2],[37,3,39,3],[34,3,36,3],[28,3,30,3],[31,3,33,3],[28,2,30,2],[31,2,33,2],[25,3,27,3],[16,3,18,3],[19,3,21,3],[22,3,24,3],[19,2,21,2],[22,2,24,2],[25,2,27,2],[91,2,93,2],[73,2,75,2],[76,2,78,2],[79,2,81,2],[55,2,57,2],[55,3,57,3],[55,13,57,13],[55,14,57,14],[58,2,60,2],[58,3,60,3],[58,13,60,13],[58,14,60,14],[61,2,63,2],[61,3,63,3],[61,13,63,13],[61,14,63,14],[64,2,66,2],[64,3,66,3],[64,13,66,13],[64,14,66,14],[67,2,69,2],[67,3,69,3],[67,13,69,13],[67,14,69,14],[79,13,81,13],[70,3,72,3],[70,13,72,13],[70,14,72,14],[97,14,99,14],[100,14,102,14],[82,2,84,2],[82,3,84,3],[82,13,84,13],[85,2,87,2],[85,3,87,3],[85,13,87,13],[85,14,87,14],[88,2,90,2],[88,3,90,3],[88,13,90,13],[88,14,90,14],[82,14,84,14],[97,2,99,2],[97,3,99,3],[97,13,99,13],[100,2,102,2],[100,3,102,3],[100,13,102,13],[79,14,81,14],[91,3,93,3],[91,13,93,13],[94,2,96,2],[94,3,96,3],[94,13,96,13],[49,14,51,14],[52,14,54,14],[28,14,30,14],[31,14,33,14],[34,14,36,14],[37,14,39,14],[40,14,42,14],[43,14,45,14],[46,14,48,14],[91,14,93,14],[94,14,96,14],[73,3,75,3],[73,13,75,13],[73,14,75,14],[76,3,78,3],[76,13,78,13],[76,14,78,14],[79,3,81,3]]}
[null,"GOVT. GIRLS' HR. SEC. SCHOOL, NIMBAHERA,                                                  TEACHER-WISE TIME TABLE FOR THE YEAR 2014-15"]
[null,"PRAYER","POST + RESPONSI-BILITIES","PERIOD",1,2,3,4," BREAK      ",5,6,7,8,"TTL PERIODS PER WEEK","SIGNATURE"]
[null,"7:00-7:20",null,"SUMMER TIMINGS","07:20-07:55","07:55-08:30","08:30-09:05","09:05-09:40",null,"10:10-10:45","10:45-11:20","11:20-11:55","11:55-12:25"]
[null,"7:30-7:50",null,"WINTER TIMINGS","07:50-08:25","08:25-08:55","08:55-09:25","09:25-09:55",null,"10:25-10:55","10:55-11:25","11:25-11:55","11:55-12:25"]
[1,"MR. A",{"$f":"CONCATENATE(B6,\", \",B7)","v":"LECTURER, BIOLOGY "},"OFFICIATING OFFICER",null,"11th D","12th D ",null,null,"12th D BIO. PR.","12th D BIO. PR.","11th D BIO. PR.","11th D BIO. PR.",28]
[2,"LECTURER",null,null,null,"BIOLOGY 1 TO 6","BIOLOGY 1 TO 6",null,"09:40-10:10         "," D1 1,2  D2 3,4"," D1 1,2  D2 3,4"," D1 3,4  D2 5,6"," D1 3,4  D2 5,6"]
[3,"BIOLOGY ",null,null,{"$f":"IF(OR($B5=\"\",E5=\"\"),\"\",$B5)","v":""},{"$f":"IF(OR($B5=\"\",F5=\"\"),\"\",$B5)","v":"MR. A"},{"$f":"IF(OR($B5=\"\",G5=\"\"),\"\",$B5)","v":"MR. A"},{"$f":"IF(OR($B5=\"\",H5=\"\"),\"\",$B5)","v":""},null,{"$f":"IF(OR($B5=\"\",J5=\"\"),\"\",$B5)","v":"MR. A"},{"$f":"IF(OR($B5=\"\",K5=\"\"),\"\",$B5)","v":"MR. A"},{"$f":"IF(OR($B5=\"\",L5=\"\"),\"\",$B5)","v":"MR. A"},{"$f":"IF(OR($B5=\"\",M5=\"\"),\"\",$B5)","v":"MR. A"}]
[4,"MR. B",{"$f":"CONCATENATE(B9,\", \",B10)","v":"LECTURER , CHEMISTRY"},"CT 12 D, NSS, SCIENCE CLUB              CT 12 D","12th D",null,"11th D","12th D ",null,"12th D CHEM. PR.","12th D CHEM. PR.","11th D CHEM . PR.","11th D CHEM . PR.",32]
[5,"LECTURER ",null,null,"CHEMISTRY 1 TO 6",null,"CHEMISTRY 1 TO 6","RAJ STD. 1-3 CH 4",null," D1 3,4  D2 5,6"," D1 3,4  D2 5,6"," D1 5,6  D2 1,2"," D1 5,6  D2 1,2"]
[6,"CHEMISTRY",null,null,{"$f":"IF(OR($B8=\"\",E8=\"\"),\"\",$B8)","v":"MR. B"},{"$f":"IF(OR($B8=\"\",F8=\"\"),\"\",$B8)","v":""},{"$f":"IF(OR($B8=\"\",G8=\"\"),\"\",$B8)","v":"MR. B"},{"$f":"IF(OR($B8=\"\",H8=\"\"),\"\",$B8)","v":"MR. B"},null,{"$f":"IF(OR($B8=\"\",J8=\"\"),\"\",$B8)","v":"MR. B"},{"$f":"IF(OR($B8=\"\",K8=\"\"),\"\",$B8)","v":"MR. B"},{"$f":"IF(OR($B8=\"\",L8=\"\"),\"\",$B8)","v":"MR. B"},{"$f":"IF(OR($B8=\"\",M8=\"\"),\"\",$B8)","v":"MR. B"}]
[7,"VACANT POST 1",{"$f":"CONCATENATE(B12,\", \",B13)","v":"LECTURER, PHYSICS "},null,"11th D ","12th D",null,"12th D ","09:55-10:25","12th D PHY. PR.","12th D PHY. PR.","11th D PHY. PR.","11th D PHY. PR.",30]
[8,"LECTURER",null,null,"PHYSICS 1 TO 6","PHYSICS 1 TO 6",null,"PHYSICS 5,6",null," D1 5,6  D2 1,2"," D1 5,6  D2 1,2"," D1 1,2  D2 3,4"," D1 1,2  D2 3,4"]
[9,"PHYSICS ",null,null,{"$f":"IF(OR($B11=\"\",E11=\"\"),\"\",$B11)","v":"VACANT POST 1"},{"$f":"IF(OR($B11=\"\",F11=\"\"),\"\",$B11)","v":"VACANT POST 1"},{"$f":"IF(OR($B11=\"\",G11=\"\"),\"\",$B11)","v":""},{"$f":"IF(OR($B11=\"\",H11=\"\"),\"\",$B11)","v":"VACANT POST 1"},null,{"$f":"IF(OR($B11=\"\",J11=\"\"),\"\",$B11)","v":"VACANT POST 1"},{"$f":"IF(OR($B11=\"\",K11=\"\"),\"\",$B11)","v":"VACANT POST 1"},{"$f":"IF(OR($B11=\"\",L11=\"\"),\"\",$B11)","v":"VACANT POST 1"},{"$f":"IF(OR($B11=\"\",M11=\"\"),\"\",$B11)","v":"VACANT POST 1"}]
[10,"MR. C",{"$f":"CONCATENATE(B15,\", \",B16)","v":"LECTURER, ENGLISH "},"FIRST ASSISTANT, LOCAL EXAM.. TIME TABLE INCHARGE, STATE . ICT CO-ORDINATOR","12th C","12th B",null,"12th A",null,"12th E ",null,"12th D ",null,30]
[11,"LECTURER",null,null,"ENGLISH 1 TO 6","ENGLISH 1 TO 6",null,"ENGLISH 1 TO 6",null,"ENGLISH 1 TO 6",null,"ENGLISH 1 TO 6"]
[12,"ENGLISH ",null,null,{"$f":"IF(OR($B14=\"\",E14=\"\"),\"\",$B14)","v":"MR. C"},{"$f":"IF(OR($B14=\"\",F14=\"\"),\"\",$B14)","v":"MR. C"},{"$f":"IF(OR($B14=\"\",G14=\"\"),\"\",$B14)","v":""},{"$f":"IF(OR($B14=\"\",H14=\"\"),\"\",$B14)","v":"MR. C"},null,{"$f":"IF(OR($B14=\"\",J14=\"\"),\"\",$B14)","v":"MR. C"},{"$f":"IF(OR($B14=\"\",K14=\"\"),\"\",$B14)","v":""},{"$f":"IF(OR($B14=\"\",L14=\"\"),\"\",$B14)","v":"MR. C"},{"$f":"IF(OR($B14=\"\",M14=\"\"),\"\",$B14)","v":""}]
[13,"MR. D",{"$f":"CONCATENATE(B18,\", \",B19)","v":"G. LECTURER, ENGLISH"},"CT 12 E",null,null,"11th C+B","11th E+A",null,null,"11th D",null,null,18]
[14,"G. LECTURER",null,null,null,null,"ENGLISH 1 TO 6","ENGLISH 1 TO 6",null,null,"ENGLISH 1 TO 6"]
[15,"ENGLISH",null,null,{"$f":"IF(OR($B17=\"\",E17=\"\"),\"\",$B17)","v":""},{"$f":"IF(OR($B17=\"\",F17=\"\"),\"\",$B17)","v":""},{"$f":"IF(OR($B17=\"\",G17=\"\"),\"\",$B17)","v":"MR. D"},{"$f":"IF(OR($B17=\"\",H17=\"\"),\"\",$B17)","v":"MR. D"},null,{"$f":"IF(OR($B17=\"\",J17=\"\"),\"\",$B17)","v":""},{"$f":"IF(OR($B17=\"\",K17=\"\"),\"\",$B17)","v":"MR. D"},{"$f":"IF(OR($B17=\"\",L17=\"\"),\"\",$B17)","v":""},{"$f":"IF(OR($B17=\"\",M17=\"\"),\"\",$B17)","v":""}]
[16,"MR. E",{"$f":"CONCATENATE(B21,\", \",B22)","v":"LECTURER, HINDI "},"SECRETARY SDMC,                    CT 11 B","11th C+B",null,"12th A","12th C O",null,"11th D",null,"11th E+A","12th E+A","29+6"]
[17,"LECTURER",null,null,"HINDI COM. 1 TO 6",null,"HINDI LIT. 1 TO 6"," HINDI COM. 1 TO 6",null,"HINDI  1 TO 6",null,"HINDI  1 TO 6","HINDI LIT.1-3,5,6"]
[18,"HINDI ",null,null,{"$f":"IF(OR($B20=\"\",E20=\"\"),\"\",$B20)","v":"MR. E"},{"$f":"IF(OR($B20=\"\",F20=\"\"),\"\",$B20)","v":""},{"$f":"IF(OR($B20=\"\",G20=\"\"),\"\",$B20)","v":"MR. E"},{"$f":"IF(OR($B20=\"\",H20=\"\"),\"\",$B20)","v":"MR. E"},null,{"$f":"IF(OR($B20=\"\",J20=\"\"),\"\",$B20)","v":"MR. E"},{"$f":"IF(OR($B20=\"\",K20=\"\"),\"\",$B20)","v":""},{"$f":"IF(OR($B20=\"\",L20=\"\"),\"\",$B20)","v":"MR. E"},{"$f":"IF(OR($B20=\"\",M20=\"\"),\"\",$B20)","v":"MR. E"}]
[19,"MR. F",{"$f":"CONCATENATE(B24,\", \",B25)","v":"LECTURER , HINDI"},"PYAYER ASSEMBLY, G.K., CT 12 A","12th E+A","11th E+A","12th E","12th B",null,null,"11th E+A",null,"12th D","29+6"]
[20,"LECTURER ",null,null," HINDI COM. 1 TO 6"," HINDI LIT. 1 TO 6","HINDI LIT. 1 TO 6"," HINDI COM. 1 TO 6",null,null," HINDI LIT. 3 TO 6",null," HINDI 1 TO 6"]
[21,"HINDI",null,null,{"$f":"IF(OR($B23=\"\",E23=\"\"),\"\",$B23)","v":"MR. F"},{"$f":"IF(OR($B23=\"\",F23=\"\"),\"\",$B23)","v":"MR. F"},{"$f":"IF(OR($B23=\"\",G23=\"\"),\"\",$B23)","v":"MR. F"},{"$f":"IF(OR($B23=\"\",H23=\"\"),\"\",$B23)","v":"MR. F"},null,{"$f":"IF(OR($B23=\"\",J23=\"\"),\"\",$B23)","v":""},{"$f":"IF(OR($B23=\"\",K23=\"\"),\"\",$B23)","v":"MR. F"},{"$f":"IF(OR($B23=\"\",L23=\"\"),\"\",$B23)","v":""},{"$f":"IF(OR($B23=\"\",M23=\"\"),\"\",$B23)","v":"MR. F"}]
[22,"MR. G",{"$f":"CONCATENATE(B27,\", \",B28)","v":"LECTURER , HISTORY"},"SCHOOL PLAN, HERITAGE CLUC+BT 12 B","12th B","12th C",null,"11th C+B",null,"11th C+B ","12th C ",null,"12th B","29+5"]
[23,"LECTURER ",null,null,"HISTORY 1 TO 6","HISTORY 1 TO 6",null,"HISTORY 1 TO 6",null,"HISTORY 3 TO 6","HISTORY 1 TO 5",null,"HISTORY 1,3-6"]
[24,"HISTORY",null,null,{"$f":"IF(OR($B26=\"\",E26=\"\"),\"\",$B26)","v":"MR. G"},{"$f":"IF(OR($B26=\"\",F26=\"\"),\"\",$B26)","v":"MR. G"},{"$f":"IF(OR($B26=\"\",G26=\"\"),\"\",$B26)","v":""},{"$f":"IF(OR($B26=\"\",H26=\"\"),\"\",$B26)","v":"MR. G"},null,{"$f":"IF(OR($B26=\"\",J26=\"\"),\"\",$B26)","v":"MR. G"},{"$f":"IF(OR($B26=\"\",K26=\"\"),\"\",$B26)","v":"MR. G"},{"$f":"IF(OR($B26=\"\",L26=\"\"),\"\",$B26)","v":""},{"$f":"IF(OR($B26=\"\",M26=\"\"),\"\",$B26)","v":"MR. G"}]
[25,"MR. H",{"$f":"CONCATENATE(B30,\", \",B31)","v":"LECTURER, POL. SCIENCE "},"STUDENT WELFARE COMMISSION            CT 11 A","11th A","12th A",null,null,null,"12th B","12th A","12th B","11th A","28+4"]
[26,"LECTURER",null,null,"POL. SC. 1 TO 6","POL. SC. 1 TO 6",null,null,null,"POL. SC. 1 TO 6","POL. SC. 1, 3 TO 6","POL. SC. 2-6","POL. SC. 1 TO 4"]
[27,"POL. SCIENCE ",null,null,{"$f":"IF(OR($B29=\"\",E29=\"\"),\"\",$B29)","v":"MR. H"},{"$f":"IF(OR($B29=\"\",F29=\"\"),\"\",$B29)","v":"MR. H"},{"$f":"IF(OR($B29=\"\",G29=\"\"),\"\",$B29)","v":""},{"$f":"IF(OR($B29=\"\",H29=\"\"),\"\",$B29)","v":""},null,{"$f":"IF(OR($B29=\"\",J29=\"\"),\"\",$B29)","v":"MR. H"},{"$f":"IF(OR($B29=\"\",K29=\"\"),\"\",$B29)","v":"MR. H"},{"$f":"IF(OR($B29=\"\",L29=\"\"),\"\",$B29)","v":"MR. H"},{"$f":"IF(OR($B29=\"\",M29=\"\"),\"\",$B29)","v":"MR. H"}]
[28,"MR. I",{"$f":"CONCATENATE(B33,\", \",B34)","v":"GUEST LECTURER, POL. SCIENCE"},"CLASS TEACHER 11 C",null,"11th C+B ","11th E+A",null,null,"11th E+A","11th B","11th C+B ","11th B ","30+4"]
[29,"GUEST LECTURER",null,null,null,"HOME SC. 1 TO 6","HOME SC. 1 TO 6",null,null,"HOME SC. 1 TO 4","POL. SC. 1 TO 6","HOME SC. 3 TO 6","POL. SC. 1 TO 4"]
[30,"POL. SCIENCE",null,null,{"$f":"IF(OR($B32=\"\",E32=\"\"),\"\",$B32)","v":""},{"$f":"IF(OR($B32=\"\",F32=\"\"),\"\",$B32)","v":"MR. I"},{"$f":"IF(OR($B32=\"\",G32=\"\"),\"\",$B32)","v":"MR. I"},{"$f":"IF(OR($B32=\"\",H32=\"\"),\"\",$B32)","v":""},null,{"$f":"IF(OR($B32=\"\",J32=\"\"),\"\",$B32)","v":"MR. I"},{"$f":"IF(OR($B32=\"\",K32=\"\"),\"\",$B32)","v":"MR. I"},{"$f":"IF(OR($B32=\"\",L32=\"\"),\"\",$B32)","v":"MR. I"},{"$f":"IF(OR($B32=\"\",M32=\"\"),\"\",$B32)","v":"MR. I"}]
[31,"MR. J",{"$f":"CONCATENATE(B36,\", \",B37)","v":"LECTURER, H. SCIENCE "},"CLASS TEACHER            12 C",null,null,"12th C+B","12th E",null,"12th A","12th B","12th E+A ","12th C","28+5"]
[32,"LECTURER",null,null,null,null,"HOME. SC. 1-6","HOME SC. 1 TO 6",null,"HOME SC. 1 TO 6","HOME. SC. 1 TO 5","HOME  SC.1,2,4-6 ","HOME. SC. 1,3-6"]
[33,"H. SCIENCE ",null,null,{"$f":"IF(OR($B35=\"\",E35=\"\"),\"\",$B35)","v":""},{"$f":"IF(OR($B35=\"\",F35=\"\"),\"\",$B35)","v":""},{"$f":"IF(OR($B35=\"\",G35=\"\"),\"\",$B35)","v":"MR. J"},{"$f":"IF(OR($B35=\"\",H35=\"\"),\"\",$B35)","v":"MR. J"},null,{"$f":"IF(OR($B35=\"\",J35=\"\"),\"\",$B35)","v":"MR. J"},{"$f":"IF(OR($B35=\"\",K35=\"\"),\"\",$B35)","v":"MR. J"},{"$f":"IF(OR($B35=\"\",L35=\"\"),\"\",$B35)","v":"MR. J"},{"$f":"IF(OR($B35=\"\",M35=\"\"),\"\",$B35)","v":"MR. J"}]
[34,"MR. K",{"$f":"CONCATENATE(B39,\", \",B40)","v":"SN. TEACHER, URDU "},"IN-CHARGE BOARD EXAM.",null,null,null,null,null,"12th C ","11th C ","12th C ","11th C ",21]
[35,"SN. TEACHER",null,null,null,null,null,null,null,"URDU 1 TO 6","URDU 1 TO 6","URDU 2-6","URDU 1 TO 4"]
[36,"URDU ",null,null,{"$f":"IF(OR($B38=\"\",E38=\"\"),\"\",$B38)","v":""},{"$f":"IF(OR($B38=\"\",F38=\"\"),\"\",$B38)","v":""},{"$f":"IF(OR($B38=\"\",G38=\"\"),\"\",$B38)","v":""},{"$f":"IF(OR($B38=\"\",H38=\"\"),\"\",$B38)","v":""},null,{"$f":"IF(OR($B38=\"\",J38=\"\"),\"\",$B38)","v":"MR. K"},{"$f":"IF(OR($B38=\"\",K38=\"\"),\"\",$B38)","v":"MR. K"},{"$f":"IF(OR($B38=\"\",L38=\"\"),\"\",$B38)","v":"MR. K"},{"$f":"IF(OR($B38=\"\",M38=\"\"),\"\",$B38)","v":"MR. K"}]
[37,"VACANT POST 2",{"$f":"CONCATENATE(B42,\", \",B43)","v":"LECTURER, GEOGRAPHY"},null,"11th E","12th E",null,null,null,null,"12th E ",null,"11th E ",21]
[38,"LECTURER",null,null,"GEOGRAPHY 1-6","GEOGRAPHY 1 to 6",null,null,null,null,"GEOGRAPHY 1, 3 TO 6",null,"GEOGRAPHY 1 TO 4"]
[39,"GEOGRAPHY",null,null,{"$f":"IF(OR($B41=\"\",E41=\"\"),\"\",$B41)","v":"VACANT POST 2"},{"$f":"IF(OR($B41=\"\",F41=\"\"),\"\",$B41)","v":"VACANT POST 2"},{"$f":"IF(OR($B41=\"\",G41=\"\"),\"\",$B41)","v":""},{"$f":"IF(OR($B41=\"\",H41=\"\"),\"\",$B41)","v":""},null,{"$f":"IF(OR($B41=\"\",J41=\"\"),\"\",$B41)","v":""},{"$f":"IF(OR($B41=\"\",K41=\"\"),\"\",$B41)","v":"VACANT POST 2"},{"$f":"IF(OR($B41=\"\",L41=\"\"),\"\",$B41)","v":""},{"$f":"IF(OR($B41=\"\",M41=\"\"),\"\",$B41)","v":"VACANT POST 2"}]
[40,"MR. K",{"$f":"CONCATENATE(B45,\", \",B46)","v":"PTI, GRADE II"},"DISCIPLINE",null,null,null,null,null,"11 B ,C RAJ ST 3, JK 4,  11 E+A RAJ ST 5,6 SG","11 E+A JK  1,2 SG","11 C+B  RAJ STD 1,2","11 C+B  RAJ STD 5,6,          11 E+A JK  5 RAJ ST 6 SG",12]
[41,"PTI"]
[42,"GRADE II",null,null,{"$f":"IF(OR($B44=\"\",E44=\"\"),\"\",$B44)","v":""},{"$f":"IF(OR($B44=\"\",F44=\"\"),\"\",$B44)","v":""},{"$f":"IF(OR($B44=\"\",G44=\"\"),\"\",$B44)","v":""},{"$f":"IF(OR($B44=\"\",H44=\"\"),\"\",$B44)","v":""},null,{"$f":"IF(OR($B44=\"\",J44=\"\"),\"\",$B44)","v":"MR. K"},{"$f":"IF(OR($B44=\"\",K44=\"\"),\"\",$B44)","v":"MR. K"},{"$f":"IF(OR($B44=\"\",L44=\"\"),\"\",$B44)","v":"MR. K"},{"$f":"IF(OR($B44=\"\",M44=\"\"),\"\",$B44)","v":"MR. K"}]
[43,"MR. L",{"$f":"CONCATENATE(B48,\", \",B49)","v":"LAB. ASSTT., BIOLOGY"},"ASSTT.                       IN-CHARGE         LOCAL EXAM.",null,null,null,null,null,"12th D BIO. PR.","12th D BIO. PR.","11th D BIO. PR.","11th D BIO. PR.",19]
[44,"LAB. ASSTT.",null,null,null,null,null,null,null," D1 1,2  D2 3,4"," D1 1,2  D2 3,4,12th C+B RAJ ST 6"," D1 3,4  D2 5,6, 12th C+B RAJ ST 1"," D1 3,4  D2 5,6, 12th C+B RAJ ST 2"]
[45,"BIOLOGY",null,null,{"$f":"IF(OR($B47=\"\",E47=\"\"),\"\",$B47)","v":""},{"$f":"IF(OR($B47=\"\",F47=\"\"),\"\",$B47)","v":""},{"$f":"IF(OR($B47=\"\",G47=\"\"),\"\",$B47)","v":""},{"$f":"IF(OR($B47=\"\",H47=\"\"),\"\",$B47)","v":""},null,{"$f":"IF(OR($B47=\"\",J47=\"\"),\"\",$B47)","v":"MR. L"},{"$f":"IF(OR($B47=\"\",K47=\"\"),\"\",$B47)","v":"MR. L"},{"$f":"IF(OR($B47=\"\",L47=\"\"),\"\",$B47)","v":"MR. L"},{"$f":"IF(OR($B47=\"\",M47=\"\"),\"\",$B47)","v":"MR. L"}]
[46,"MR. M",{"$f":"CONCATENATE(B51,\", \",B52)","v":"LAB. ASSTT., CHEMISTRY"},"CLASS TEACHER       11 D + ASSTT.      IN-CHARGE  BOARD EXAM.",null,null,null,null,null,"12th D CHEM. PR.","12th D CHEM. PR.","11th D CHEM . PR.","11th D CHEM . PR.",19]
[47,"LAB. ASSTT.",null,null,null,null,null,null,null," D1 3,4  D2 5,6"," D1 3,4  D2 5,6, 12th E+A RAJ ST 2 AM"," D1 5,6  D2 1,2,12th E+A RAJ STD 3 AM"," D1 5,6  D2 1,2, 12th E+A RAJ STD 4 AM"]
[48,"CHEMISTRY",null,null,{"$f":"IF(OR($B50=\"\",E50=\"\"),\"\",$B50)","v":""},{"$f":"IF(OR($B50=\"\",F50=\"\"),\"\",$B50)","v":""},{"$f":"IF(OR($B50=\"\",G50=\"\"),\"\",$B50)","v":""},{"$f":"IF(OR($B50=\"\",H50=\"\"),\"\",$B50)","v":""},null,{"$f":"IF(OR($B50=\"\",J50=\"\"),\"\",$B50)","v":"MR. M"},{"$f":"IF(OR($B50=\"\",K50=\"\"),\"\",$B50)","v":"MR. M"},{"$f":"IF(OR($B50=\"\",L50=\"\"),\"\",$B50)","v":"MR. M"},{"$f":"IF(OR($B50=\"\",M50=\"\"),\"\",$B50)","v":"MR. M"}]
[49,"MR. N",{"$f":"CONCATENATE(B54,\", \",B55)","v":"LAB. ASSTT., PHYSICS"},"CLASS TEACHER       11 E",null,null,null,"11th D",null,"12th D PHY. PR.","12th D PHY. PR.","11th D PHY. PR.",null,"22+2"]
[50,"LAB. ASSTT.",null,null,null,null,null,"RAJ ST 1-3 JK 4-6",null," D1 5,6  D2 1,2"," D1 5,6  D2 1,2"," D1 1,2  D2 3,4"," D1 1,2  D2 3,4,11 C+B  RAJ STD 5,6"]
[51,"PHYSICS",null,null,{"$f":"IF(OR($B53=\"\",E53=\"\"),\"\",$B53)","v":""},{"$f":"IF(OR($B53=\"\",F53=\"\"),\"\",$B53)","v":""},{"$f":"IF(OR($B53=\"\",G53=\"\"),\"\",$B53)","v":""},{"$f":"IF(OR($B53=\"\",H53=\"\"),\"\",$B53)","v":"MR. N"},null,{"$f":"IF(OR($B53=\"\",J53=\"\"),\"\",$B53)","v":"MR. N"},{"$f":"IF(OR($B53=\"\",K53=\"\"),\"\",$B53)","v":"MR. N"},{"$f":"IF(OR($B53=\"\",L53=\"\"),\"\",$B53)","v":"MR. N"},{"$f":"IF(OR($B53=\"\",M53=\"\"),\"\",$B53)","v":""}]
[52,null,null,null,null,null,null,null,null,null,null,null,null,30]
[53]
[54,null,null,null,{"$f":"IF(OR($B56=\"\",E56=\"\"),\"\",$B56)","v":""},{"$f":"IF(OR($B56=\"\",F56=\"\"),\"\",$B56)","v":""},{"$f":"IF(OR($B56=\"\",G56=\"\"),\"\",$B56)","v":""},{"$f":"IF(OR($B56=\"\",H56=\"\"),\"\",$B56)","v":""},null,{"$f":"IF(OR($B56=\"\",J56=\"\"),\"\",$B56)","v":""},{"$f":"IF(OR($B56=\"\",K56=\"\"),\"\",$B56)","v":""},{"$f":"IF(OR($B56=\"\",L56=\"\"),\"\",$B56)","v":""},{"$f":"IF(OR($B56=\"\",M56=\"\"),\"\",$B56)","v":""}]
[55,null,null,null,null,null,null,null,null,null,null,null,null,18]
[56]
[57,null,null,null,{"$f":"IF(OR($B59=\"\",E59=\"\"),\"\",$B59)","v":""},{"$f":"IF(OR($B59=\"\",F59=\"\"),\"\",$B59)","v":""},{"$f":"IF(OR($B59=\"\",G59=\"\"),\"\",$B59)","v":""},{"$f":"IF(OR($B59=\"\",H59=\"\"),\"\",$B59)","v":""},null,{"$f":"IF(OR($B59=\"\",J59=\"\"),\"\",$B59)","v":""},{"$f":"IF(OR($B59=\"\",K59=\"\"),\"\",$B59)","v":""},{"$f":"IF(OR($B59=\"\",L59=\"\"),\"\",$B59)","v":""},{"$f":"IF(OR($B59=\"\",M59=\"\"),\"\",$B59)","v":""}]
[58,null,null,null,null,null,null,null,null,null,null,null,null,"29+6"]
[59]
[60,null,null,null,{"$f":"IF(OR($B62=\"\",E62=\"\"),\"\",$B62)","v":""},{"$f":"IF(OR($B62=\"\",F62=\"\"),\"\",$B62)","v":""},{"$f":"IF(OR($B62=\"\",G62=\"\"),\"\",$B62)","v":""},{"$f":"IF(OR($B62=\"\",H62=\"\"),\"\",$B62)","v":""},null,{"$f":"IF(OR($B62=\"\",J62=\"\"),\"\",$B62)","v":""},{"$f":"IF(OR($B62=\"\",K62=\"\"),\"\",$B62)","v":""},{"$f":"IF(OR($B62=\"\",L62=\"\"),\"\",$B62)","v":""},{"$f":"IF(OR($B62=\"\",M62=\"\"),\"\",$B62)","v":""}]
[61,null,null,null,null,null,null,null,null,null,null,null,null,"29+6"]
[62]
[63,null,null,null,{"$f":"IF(OR($B65=\"\",E65=\"\"),\"\",$B65)","v":""},{"$f":"IF(OR($B65=\"\",F65=\"\"),\"\",$B65)","v":""},{"$f":"IF(OR($B65=\"\",G65=\"\"),\"\",$B65)","v":""},{"$f":"IF(OR($B65=\"\",H65=\"\"),\"\",$B65)","v":""},null,{"$f":"IF(OR($B65=\"\",J65=\"\"),\"\",$B65)","v":""},{"$f":"IF(OR($B65=\"\",K65=\"\"),\"\",$B65)","v":""},{"$f":"IF(OR($B65=\"\",L65=\"\"),\"\",$B65)","v":""},{"$f":"IF(OR($B65=\"\",M65=\"\"),\"\",$B65)","v":""}]
[64,null,null,null,null,null,null,null,null,null,null,null,null,"29+5"]
[65]
[66,null,null,null,{"$f":"IF(OR($B68=\"\",E68=\"\"),\"\",$B68)","v":""},{"$f":"IF(OR($B68=\"\",F68=\"\"),\"\",$B68)","v":""},{"$f":"IF(OR($B68=\"\",G68=\"\"),\"\",$B68)","v":""},{"$f":"IF(OR($B68=\"\",H68=\"\"),\"\",$B68)","v":""},null,{"$f":"IF(OR($B68=\"\",J68=\"\"),\"\",$B68)","v":""},{"$f":"IF(OR($B68=\"\",K68=\"\"),\"\",$B68)","v":""},{"$f":"IF(OR($B68=\"\",L68=\"\"),\"\",$B68)","v":""},{"$f":"IF(OR($B68=\"\",M68=\"\"),\"\",$B68)","v":""}]
[67,null,null,null,null,null,null,null,null,null,null,null,null,"28+4"]
[68]
[69,null,null,null,{"$f":"IF(OR($B71=\"\",E71=\"\"),\"\",$B71)","v":""},{"$f":"IF(OR($B71=\"\",F71=\"\"),\"\",$B71)","v":""},{"$f":"IF(OR($B71=\"\",G71=\"\"),\"\",$B71)","v":""},{"$f":"IF(OR($B71=\"\",H71=\"\"),\"\",$B71)","v":""},null,{"$f":"IF(OR($B71=\"\",J71=\"\"),\"\",$B71)","v":""},{"$f":"IF(OR($B71=\"\",K71=\"\"),\"\",$B71)","v":""},{"$f":"IF(OR($B71=\"\",L71=\"\"),\"\",$B71)","v":""},{"$f":"IF(OR($B71=\"\",M71=\"\"),\"\",$B71)","v":""}]
[70,null,null,null,null,null,null,null,null,null,null,null,null,"30+4"]
[71]
[72,null,null,null,{"$f":"IF(OR($B74=\"\",E74=\"\"),\"\",$B74)","v":""},{"$f":"IF(OR($B74=\"\",F74=\"\"),\"\",$B74)","v":""},{"$f":"IF(OR($B74=\"\",G74=\"\"),\"\",$B74)","v":""},{"$f":"IF(OR($B74=\"\",H74=\"\"),\"\",$B74)","v":""},null,{"$f":"IF(OR($B74=\"\",J74=\"\"),\"\",$B74)","v":""},{"$f":"IF(OR($B74=\"\",K74=\"\"),\"\",$B74)","v":""},{"$f":"IF(OR($B74=\"\",L74=\"\"),\"\",$B74)","v":""},{"$f":"IF(OR($B74=\"\",M74=\"\"),\"\",$B74)","v":""}]
[73,null,null,null,null,null,null,null,null,null,null,null,null,"28+5"]
[74]
[75,null,null,null,{"$f":"IF(OR($B77=\"\",E77=\"\"),\"\",$B77)","v":""},{"$f":"IF(OR($B77=\"\",F77=\"\"),\"\",$B77)","v":""},{"$f":"IF(OR($B77=\"\",G77=\"\"),\"\",$B77)","v":""},{"$f":"IF(OR($B77=\"\",H77=\"\"),\"\",$B77)","v":""},null,{"$f":"IF(OR($B77=\"\",J77=\"\"),\"\",$B77)","v":""},{"$f":"IF(OR($B77=\"\",K77=\"\"),\"\",$B77)","v":""},{"$f":"IF(OR($B77=\"\",L77=\"\"),\"\",$B77)","v":""},{"$f":"IF(OR($B77=\"\",M77=\"\"),\"\",$B77)","v":""}]
[76,null,null,null,null,null,null,null,null,null,null,null,null,21]
[77]
[78,null,null,null,{"$f":"IF(OR($B80=\"\",E80=\"\"),\"\",$B80)","v":""},{"$f":"IF(OR($B80=\"\",F80=\"\"),\"\",$B80)","v":""},{"$f":"IF(OR($B80=\"\",G80=\"\"),\"\",$B80)","v":""},{"$f":"IF(OR($B80=\"\",H80=\"\"),\"\",$B80)","v":""},null,{"$f":"IF(OR($B80=\"\",J80=\"\"),\"\",$B80)","v":""},{"$f":"IF(OR($B80=\"\",K80=\"\"),\"\",$B80)","v":""},{"$f":"IF(OR($B80=\"\",L80=\"\"),\"\",$B80)","v":""},{"$f":"IF(OR($B80=\"\",M80=\"\"),\"\",$B80)","v":""}]
[79,null,null,null,null,null,null,null,null,null,null,null,null,21]
[80]
[81,null,null,null,{"$f":"IF(OR($B83=\"\",E83=\"\"),\"\",$B83)","v":""},{"$f":"IF(OR($B83=\"\",F83=\"\"),\"\",$B83)","v":""},{"$f":"IF(OR($B83=\"\",G83=\"\"),\"\",$B83)","v":""},{"$f":"IF(OR($B83=\"\",H83=\"\"),\"\",$B83)","v":""},null,{"$f":"IF(OR($B83=\"\",J83=\"\"),\"\",$B83)","v":""},{"$f":"IF(OR($B83=\"\",K83=\"\"),\"\",$B83)","v":""},{"$f":"IF(OR($B83=\"\",L83=\"\"),\"\",$B83)","v":""},{"$f":"IF(OR($B83=\"\",M83=\"\"),\"\",$B83)","v":""}]
[82,null,null,null,null,null,null,null,null,null,null,null,null,12]
[83]
[84,null,null,null,{"$f":"IF(OR($B86=\"\",E86=\"\"),\"\",$B86)","v":""},{"$f":"IF(OR($B86=\"\",F86=\"\"),\"\",$B86)","v":""},{"$f":"IF(OR($B86=\"\",G86=\"\"),\"\",$B86)","v":""},{"$f":"IF(OR($B86=\"\",H86=\"\"),\"\",$B86)","v":""},null,{"$f":"IF(OR($B86=\"\",J86=\"\"),\"\",$B86)","v":""},{"$f":"IF(OR($B86=\"\",K86=\"\"),\"\",$B86)","v":""},{"$f":"IF(OR($B86=\"\",L86=\"\"),\"\",$B86)","v":""},{"$f":"IF(OR($B86=\"\",M86=\"\"),\"\",$B86)","v":""}]
[85,null,null,null,null,null,null,null,null,null,null,null,null,19]
[86]
[87,null,null,null,{"$f":"IF(OR($B89=\"\",E89=\"\"),\"\",$B89)","v":""},{"$f":"IF(OR($B89=\"\",F89=\"\"),\"\",$B89)","v":""},{"$f":"IF(OR($B89=\"\",G89=\"\"),\"\",$B89)","v":""},{"$f":"IF(OR($B89=\"\",H89=\"\"),\"\",$B89)","v":""},null,{"$f":"IF(OR($B89=\"\",J89=\"\"),\"\",$B89)","v":""},{"$f":"IF(OR($B89=\"\",K89=\"\"),\"\",$B89)","v":""},{"$f":"IF(OR($B89=\"\",L89=\"\"),\"\",$B89)","v":""},{"$f":"IF(OR($B89=\"\",M89=\"\"),\"\",$B89)","v":""}]
[88,null,null,null,null,null,null,null,null,null,null,null,null,19]
[89]
[90,null,null,null,{"$f":"IF(OR($B92=\"\",E92=\"\"),\"\",$B92)","v":""},{"$f":"IF(OR($B92=\"\",F92=\"\"),\"\",$B92)","v":""},{"$f":"IF(OR($B92=\"\",G92=\"\"),\"\",$B92)","v":""},{"$f":"IF(OR($B92=\"\",H92=\"\"),\"\",$B92)","v":""},null,{"$f":"IF(OR($B92=\"\",J92=\"\"),\"\",$B92)","v":""},{"$f":"IF(OR($B92=\"\",K92=\"\"),\"\",$B92)","v":""},{"$f":"IF(OR($B92=\"\",L92=\"\"),\"\",$B92)","v":""},{"$f":"IF(OR($B92=\"\",M92=\"\"),\"\",$B92)","v":""}]
[91,null,null,null,null,null,null,null,null,null,null,null,null,"22+2"]
[92]
[93,null,null,null,{"$f":"IF(OR($B95=\"\",E95=\"\"),\"\",$B95)","v":""},{"$f":"IF(OR($B95=\"\",F95=\"\"),\"\",$B95)","v":""},{"$f":"IF(OR($B95=\"\",G95=\"\"),\"\",$B95)","v":""},{"$f":"IF(OR($B95=\"\",H95=\"\"),\"\",$B95)","v":""},null,{"$f":"IF(OR($B95=\"\",J95=\"\"),\"\",$B95)","v":""},{"$f":"IF(OR($B95=\"\",K95=\"\"),\"\",$B95)","v":""},{"$f":"IF(OR($B95=\"\",L95=\"\"),\"\",$B95)","v":""},{"$f":"IF(OR($B95=\"\",M95=\"\"),\"\",$B95)","v":""}]
[94,null,null,null,null,null,null,null,null,null,null,null,null,19]
[95]
[96,null,null,null,{"$f":"IF(OR($B98=\"\",E98=\"\"),\"\",$B98)","v":""},{"$f":"IF(OR($B98=\"\",F98=\"\"),\"\",$B98)","v":""},{"$f":"IF(OR($B98=\"\",G98=\"\"),\"\",$B98)","v":""},{"$f":"IF(OR($B98=\"\",H98=\"\"),\"\",$B98)","v":""},null,{"$f":"IF(OR($B98=\"\",J98=\"\"),\"\",$B98)","v":""},{"$f":"IF(OR($B98=\"\",K98=\"\"),\"\",$B98)","v":""},{"$f":"IF(OR($B98=\"\",L98=\"\"),\"\",$B98)","v":""},{"$f":"IF(OR($B98=\"\",M98=\"\"),\"\",$B98)","v":""}]
[97,null,null,null,null,null,null,null,null,null,null,null,null,19]
[98]
[99,null,null,null,{"$f":"IF(OR($B101=\"\",E101=\"\"),\"\",$B101)","v":""},{"$f":"IF(OR($B101=\"\",F101=\"\"),\"\",$B101)","v":""},{"$f":"IF(OR($B101=\"\",G101=\"\"),\"\",$B101)","v":""},{"$f":"IF(OR($B101=\"\",H101=\"\"),\"\",$B101)","v":""},null,{"$f":"IF(OR($B101=\"\",J101=\"\"),\"\",$B101)","v":""},{"$f":"IF(OR($B101=\"\",K101=\"\"),\"\",$B101)","v":""},{"$f":"IF(OR($B101=\"\",L101=\"\"),\"\",$B101)","v":""},{"$f":"IF(OR($B101=\"\",M101=\"\"),\"\",$B101)","v":""}]
[100,null,null,null,null,null,null,null,null,null,null,null,null,"22+2"]
[101]
[102,null,null,null,{"$f":"IF(OR($B104=\"\",E104=\"\"),\"\",$B104)","v":""},{"$f":"IF(OR($B104=\"\",F104=\"\"),\"\",$B104)","v":""},{"$f":"IF(OR($B104=\"\",G104=\"\"),\"\",$B104)","v":""},{"$f":"IF(OR($B104=\"\",H104=\"\"),\"\",$B104)","v":""},null,{"$f":"IF(OR($B104=\"\",J104=\"\"),\"\",$B104)","v":""},{"$f":"IF(OR($B104=\"\",K104=\"\"),\"\",$B104)","v":""},{"$f":"IF(OR($B104=\"\",L104=\"\"),\"\",$B104)","v":""},{"$f":"IF(OR($B104=\"\",M104=\"\"),\"\",$B104)","v":""}]

{"sheet":"slips for individual teachers","index":2,"n_rows":510,"n_cols":5,"rows_kept":510,"cut":false,"hidden":false,"merged":[[465,0,466,3],[465,4,466,4],[467,0,468,0],[467,1,468,1],[467,2,468,2],[467,3,468,3],[467,4,468,4],[469,3,469,4],[479,0,479,2],[450,0,451,3],[450,4,451,4],[452,0,453,0],[452,1,453,1],[452,2,453,2],[452,3,453,3],[452,4,453,4],[454,3,454,4],[464,0,464,2],[435,0,436,3],[435,4,436,4],[437,0,438,0],[437,1,438,1],[437,2,438,2],[437,3,438,3],[437,4,438,4],[439,3,439,4],[449,0,449,2],[420,0,421,3],[420,4,421,4],[422,0,423,0],[422,1,423,1],[422,2,423,2],[422,3,423,3],[422,4,423,4],[424,3,424,4],[434,0,434,2],[405,0,406,3],[405,4,406,4],[407,0,408,0],[407,1,408,1],[407,2,408,2],[407,3,408,3],[407,4,408,4],[409,3,409,4],[419,0,419,2],[390,0,391,3],[390,4,391,4],[392,0,393,0],[392,1,393,1],[392,2,393,2],[392,3,393,3],[392,4,393,4],[394,3,394,4],[404,0,404,2],[375,0,376,3],[375,4,376,4],[377,0,378,0],[377,1,378,1],[377,2,378,2],[377,3,378,3],[377,4,378,4],[379,3,379,4],[389,0,389,2],[360,0,361,3],[360,4,361,4],[362,0,363,0],[362,1,363,1],[362,2,363,2],[362,3,363,3],[362,4,363,4],[364,3,364,4],[374,0,374,2],[345,0,346,3],[345,4,346,4],[347,0,348,0],[347,1,348,1],[347,2,348,2],[347,3,348,3],[347,4,348,4],[349,3,349,4],[359,0,359,2],[330,0,331,3],[330,4,331,4],[332,0,333,0],[332,1,333,1],[332,2,333,2],[332,3,333,3],[332,4,333,4],[334,3,334,4],[344,0,344,2],[315,0,316,3],[315,4,316,4],[317,0,318,0],[317,1,318,1],[317,2,318,2],[317,3,318,3],[317,4,318,4],[319,3,319,4],[329,0,329,2],[300,0,301,3],[300,4,301,4],[302,0,303,0],[302,1,303,1],[302,2,303,2],[302,3,303,3],[302,4,303,4],[304,3,304,4],[314,0,314,2],[285,0,286,3],[285,4,286,4],[287,0,288,0],[287,1,288,1],[287,2,288,2],[287,3,288,3],[287,4,288,4],[289,3,289,4],[299,0,299,2],[270,0,271,3],[270,4,271,4],[272,0,273,0],[272,1,273,1],[272,2,273,2],[272,3,273,3],[272,4,273,4],[274,3,274,4],[284,0,284,2],[0,0,1,3],[0,4,1,4],[2,0,3,0],[2,1,3,1],[2,2,3,2],[2,3,3,3],[2,4,3,4],[4,3,4,4],[14,0,14,2],[255,0,256,3],[255,4,256,4],[257,0,258,0],[257,1,258,1],[257,2,258,2],[257,3,258,3],[257,4,258,4],[259,3,259,4],[269,0,269,2],[240,0,241,3],[240,4,241,4],[242,0,243,0],[242,1,243,1],[242,2,243,2],[242,3,243,3],[242,4,243,4],[244,3,244,4],[254,0,254,2],[225,0,226,3],[225,4,226,4],[227,0,228,0],[227,1,228,1],[227,2,228,2],[227,3,228,3],[227,4,228,4],[229,3,229,4],[239,0,239,2],[210,0,211,3],[210,4,211,4],[212,0,213,0],[212,1,213,1],[212,2,213,2],[212,3,213,3],[212,4,213,4],[214,3,214,4],[224,0,224,2],[195,0,196,3],[195,4,196,4],[197,0,198,0],[197,1,198,1],[197,2,198,2],[197,3,198,3],[197,4,198,4],[199,3,199,4],[209,0,209,2],[180,0,181,3],[180,4,181,4],[182,0,183,0],[182,1,183,1],[182,2,183,2],[182,3,183,3],[182,4,183,4],[184,3,184,4],[194,0,194,2],[165,0,166,3],[165,4,166,4],[167,0,168,0],[167,1,168,1],[167,2,168,2],[167,3,168,3],[167,4,168,4],[169,3,169,4],[179,0,179,2],[150,0,151,3],[150,4,151,4],[152,0,153,0],[152,1,153,1],[152,2,153,2],[152,3,153,3],[152,4,153,4],[154,3,154,4],[164,0,164,2],[135,0,136,3],[135,4,136,4],[137,0,138,0],[137,1,138,1],[137,2,138,2],[137,3,138,3],[137,4,138,4],[139,3,139,4],[149,0,149,2],[120,0,121,3],[120,4,121,4],[122,0,123,0],[122,1,123,1],[122,2,123,2],[122,3,123,3],[122,4,123,4],[124,3,124,4],[134,0,134,2],[105,0,106,3],[105,4,106,4],[107,0,108,0],[107,1,108,1],[107,2,108,2],[107,3,108,3],[107,4,108,4],[109,3,109,4],[119,0,119,2],[90,0,91,3],[90,4,91,4],[92,0,93,0],[92,1,93,1],[92,2,93,2],[92,3,93,3],[92,4,93,4],[94,3,94,4],[104,0,104,2],[75,0,76,3],[75,4,76,4],[77,0,78,0],[77,1,78,1],[77,2,78,2],[77,3,78,3],[77,4,78,4],[79,3,79,4],[89,0,89,2],[60,0,61,3],[60,4,61,4],[62,0,63,0],[62,1,63,1],[62,2,63,2],[62,3,63,3],[62,4,63,4],[64,3,64,4],[74,0,74,2],[45,0,46,3],[45,4,46,4],[47,0,48,0],[47,1,48,1],[47,2,48,2],[47,3,48,3],[47,4,48,4],[49,3,49,4],[59,0,59,2],[30,0,31,3],[30,4,31,4],[32,0,33,0],[32,1,33,1],[32,2,33,2],[32,3,33,3],[32,4,33,4],[34,3,34,4],[44,0,44,2],[15,0,16,3],[15,4,16,4],[17,0,18,0],[17,1,18,1],[17,2,18,2],[17,3,18,3],[17,4,18,4],[19,3,19,4],[29,0,29,2],[480,0,481,3],[480,4,481,4],[482,0,483,0],[482,1,483,1],[482,2,483,2],[482,3,483,3],[482,4,483,4],[484,3,484,4],[494,0,494,2],[495,0,496,3],[495,4,496,4],[497,0,498,0],[497,1,498,1],[497,2,498,2],[497,3,498,3],[497,4,498,4],[499,3,499,4],[509,0,509,2]]}
[{"$f":"'teacher-wise time-table'!$B$1","v":"GOVT. GIRLS' HR. SEC. SCHOOL, NIMBAHERA,                                                  TEACHER-WISE TIME TABLE FOR THE YEAR 2014-15"},null,null,null,1]
[]
[{"$f":"'teacher-wise time-table'!$D$3","v":"SUMMER TIMINGS"},{"$f":"'teacher-wise time-table'!$D$4","v":"WINTER TIMINGS"},{"$f":"'teacher-wise time-table'!$D$2","v":"PERIOD"},{"$f":"VLOOKUP(E1,'teacher-wise time-table'!$A$5:$N$106,2)","v":"MR. A"},{"$f":"VLOOKUP(E1,'teacher-wise time-table'!$A$5:$N$106,3)","v":"LECTURER, BIOLOGY "}]
[]
[{"$f":"'teacher-wise time-table'!$B$3","v":"7:00-7:20"},{"$f":"'teacher-wise time-table'!$B$4","v":"7:30-7:50"},{"$f":"'teacher-wise time-table'!$B$2","v":"PRAYER"},{"$f":"VLOOKUP(E1,'teacher-wise time-table'!$A$5:$N$106,4)","v":"OFFICIATING OFFICER"}]
[{"$f":"'teacher-wise time-table'!$E$3","v":"07:20-07:55"},{"$f":"'teacher-wise time-table'!$E$4","v":"07:50-08:25"},{"$f":"'teacher-wise time-table'!$E$2","v":1},{"$f":"VLOOKUP(E1,'teacher-wise time-table'!$A$5:$N$106,5)","v":0},{"$f":"VLOOKUP(E1+1,'teacher-wise time-table'!$A$5:$N$106,5)","v":0}]
[{"$f":"'teacher-wise time-table'!$F$3","v":"07:55-08:30"},{"$f":"'teacher-wise time-table'!$F$4","v":"08:25-08:55"},{"$f":"'teacher-wise time-table'!$F$2","v":2},{"$f":"VLOOKUP(E1,'teacher-wise time-table'!$A$5:$N$106,6)","v":"11th D"},{"$f":"VLOOKUP(E1+1,'teacher-wise time-table'!$A$5:$N$106,6)","v":"BIOLOGY 1 TO 6"}]
[{"$f":"'teacher-wise time-table'!$G$3","v":"08:30-09:05"},{"$f":"'teacher-wise time-table'!$G$4","v":"08:55-09:25"},{"$f":"'teacher-wise time-table'!$G$2","v":3},{"$f":"VLOOKUP(E1,'teacher-wise time-table'!$A$5:$N$106,7)","v":"12th D "},{"$f":"VLOOKUP(E1+1,'teacher-wise time-table'!$A$5:$N$106,7)","v":"BIOLOGY 1 TO 6"}]
[{"$f":"'teacher-wise time-table'!$H$3","v":"09:05-09:40"},{"$f":"'teacher-wise time-table'!$H$4","v":"09:25-09:55"},{"$f":"'teacher-wise time-table'!$H$2","v":4},{"$f":"VLOOKUP(E1,'teacher-wise time-table'!$A$5:$N$106,8)","v":0},{"$f":"VLOOKUP(E1+1,'teacher-wise time-table'!$A$5:$N$106,8)","v":0}]
[{"$f":"'teacher-wise time-table'!$I$6","v":"09:40-10:10         "},{"$f":"'teacher-wise time-table'!$I$11","v":"09:55-10:25"},{"$f":"'teacher-wise time-table'!$I$2","v":" BREAK      "}]
[{"$f":"'teacher-wise time-table'!$J$3","v":"10:10-10:45"},{"$f":"'teacher-wise time-table'!$J$4","v":"10:25-10:55"},{"$f":"'teacher-wise time-table'!$J$2","v":5},{"$f":"VLOOKUP(E1,'teacher-wise time-table'!$A$5:$N$106,10)","v":"12th D BIO. PR."},{"$f":"VLOOKUP(E1+1,'teacher-wise time-table'!$A$5:$N$106,10)","v":" D1 1,2  D2 3,4"}]
[{"$f":"'teacher-wise time-table'!$K$3","v":"10:45-11:20"},{"$f":"'teacher-wise time-table'!$K$4","v":"10:55-11:25"},{"$f":"'teacher-wise time-table'!$K$2","v":6},{"$f":"VLOOKUP(E1,'teacher-wise time-table'!$A$5:$N$106,11)","v":"12th D BIO. PR."},{"$f":"VLOOKUP(E1+1,'teacher-wise time-table'!$A$5:$N$106,11)","v":" D1 1,2  D2 3,4"}]
[{"$f":"'teacher-wise time-table'!$L$3","v":"11:20-11:55"},{"$f":"'teacher-wise time-table'!$L$4","v":"11:25-11:55"},{"$f":"'teacher-wise time-table'!$L$2","v":7},{"$f":"VLOOKUP(E1,'teacher-wise time-table'!$A$5:$N$106,12)","v":"11th D BIO. PR."},{"$f":"VLOOKUP(E1+1,'teacher-wise time-table'!$A$5:$N$106,12)","v":" D1 3,4  D2 5,6"}]
[{"$f":"'teacher-wise time-table'!$M$3","v":"11:55-12:25"},{"$f":"'teacher-wise time-table'!$M$4","v":"11:55-12:25"},{"$f":"'teacher-wise time-table'!$M$2","v":8},{"$f":"VLOOKUP(E1,'teacher-wise time-table'!$A$5:$N$106,13)","v":"11th D BIO. PR."},{"$f":"VLOOKUP(E1+1,'teacher-wise time-table'!$A$5:$N$106,13)","v":" D1 3,4  D2 5,6"}]
["SIGN. OF THE PRINCIPAL",null,null,{"$f":"'teacher-wise time-table'!$N$2","v":"TTL PERIODS PER WEEK"},{"$f":"VLOOKUP(E1,'teacher-wise time-table'!$A$5:$N$106,14)","v":28}]
[{"$f":"'teacher-wise time-table'!$B$1","v":"GOVT. GIRLS' HR. SEC. SCHOOL, NIMBAHERA,                                                  TEACHER-WISE TIME TABLE FOR THE YEAR 2014-15"},null,null,null,{"$f":"E1+3","v":4}]
[]
[{"$f":"'teacher-wise time-table'!$D$3","v":"SUMMER TIMINGS"},{"$f":"'teacher-wise time-table'!$D$4","v":"WINTER TIMINGS"},{"$f":"'teacher-wise time-table'!$D$2","v":"PERIOD"},{"$f":"VLOOKUP(E16,'teacher-wise time-table'!$A$5:$N$106,2)","v":"MR. B"},{"$f":"VLOOKUP(E16,'teacher-wise time-table'!$A$5:$N$106,3)","v":"LECTURER , CHEMISTRY"}]
[]
[{"$f":"'teacher-wise time-table'!$B$3","v":"7:00-7:20"},{"$f":"'teacher-wise time-table'!$B$4","v":"7:30-7:50"},{"$f":"'teacher-wise time-table'!$B$2","v":"PRAYER"},{"$f":"VLOOKUP(E16,'teacher-wise time-table'!$A$5:$N$106,4)","v":"CT 12 D, NSS, SCIENCE CLUB              CT 12 D"}]
[{"$f":"'teacher-wise time-table'!$E$3","v":"07:20-07:55"},{"$f":"'teacher-wise time-table'!$E$4","v":"07:50-08:25"},{"$f":"'teacher-wise time-table'!$E$2","v":1},{"$f":"VLOOKUP(E16,'teacher-wise time-table'!$A$5:$N$106,5)","v":"12th D"},{"$f":"VLOOKUP(E16+1,'teacher-wise time-table'!$A$5:$N$106,5)","v":"CHEMISTRY 1 TO 6"}]
[{"$f":"'teacher-wise time-table'!$F$3","v":"07:55-08:30"},{"$f":"'teacher-wise time-table'!$F$4","v":"08:25-08:55"},{"$f":"'teacher-wise time-table'!$F$2","v":2},{"$f":"VLOOKUP(E16,'teacher-wise time-table'!$A$5:$N$106,6)","v":0},{"$f":"VLOOKUP(E16+1,'teacher-wise time-table'!$A$5:$N$106,6)","v":0}]
[{"$f":"'teacher-wise time-table'!$G$3","v":"08:30-09:05"},{"$f":"'teacher-wise time-table'!$G$4","v":"08:55-09:25"},{"$f":"'teacher-wise time-table'!$G$2","v":3},{"$f":"VLOOKUP(E16,'teacher-wise time-table'!$A$5:$N$106,7)","v":"11th D"},{"$f":"VLOOKUP(E16+1,'teacher-wise time-table'!$A$5:$N$106,7)","v":"CHEMISTRY 1 TO 6"}]
[{"$f":"'teacher-wise time-table'!$H$3","v":"09:05-09:40"},{"$f":"'teacher-wise time-table'!$H$4","v":"09:25-09:55"},{"$f":"'teacher-wise time-table'!$H$2","v":4},{"$f":"VLOOKUP(E16,'teacher-wise time-table'!$A$5:$N$106,8)","v":"12th D "},{"$f":"VLOOKUP(E16+1,'teacher-wise time-table'!$A$5:$N$106,8)","v":"RAJ STD. 1-3 CH 4"}]
[{"$f":"'teacher-wise time-table'!$I$6","v":"09:40-10:10         "},{"$f":"'teacher-wise time-table'!$I$11","v":"09:55-10:25"},{"$f":"'teacher-wise time-table'!$I$2","v":" BREAK      "}]
[{"$f":"'teacher-wise time-table'!$J$3","v":"10:10-10:45"},{"$f":"'teacher-wise time-table'!$J$4","v":"10:25-10:55"},{"$f":"'teacher-wise time-table'!$J$2","v":5},{"$f":"VLOOKUP(E16,'teacher-wise time-table'!$A$5:$N$106,10)","v":"12th D CHEM. PR."},{"$f":"VLOOKUP(E16+1,'teacher-wise time-table'!$A$5:$N$106,10)","v":" D1 3,4  D2 5,6"}]
[{"$f":"'teacher-wise time-table'!$K$3","v":"10:45-11:20"},{"$f":"'teacher-wise time-table'!$K$4","v":"10:55-11:25"},{"$f":"'teacher-wise time-table'!$K$2","v":6},{"$f":"VLOOKUP(E16,'teacher-wise time-table'!$A$5:$N$106,11)","v":"12th D CHEM. PR."},{"$f":"VLOOKUP(E16+1,'teacher-wise time-table'!$A$5:$N$106,11)","v":" D1 3,4  D2 5,6"}]
[{"$f":"'teacher-wise time-table'!$L$3","v":"11:20-11:55"},{"$f":"'teacher-wise time-table'!$L$4","v":"11:25-11:55"},{"$f":"'teacher-wise time-table'!$L$2","v":7},{"$f":"VLOOKUP(E16,'teacher-wise time-table'!$A$5:$N$106,12)","v":"11th D CHEM . PR."},{"$f":"VLOOKUP(E16+1,'teacher-wise time-table'!$A$5:$N$106,12)","v":" D1 5,6  D2 1,2"}]
[{"$f":"'teacher-wise time-table'!$M$3","v":"11:55-12:25"},{"$f":"'teacher-wise time-table'!$M$4","v":"11:55-12:25"},{"$f":"'teacher-wise time-table'!$M$2","v":8},{"$f":"VLOOKUP(E16,'teacher-wise time-table'!$A$5:$N$106,13)","v":"11th D CHEM . PR."},{"$f":"VLOOKUP(E16+1,'teacher-wise time-table'!$A$5:$N$106,13)","v":" D1 5,6  D2 1,2"}]
["SIGN. OF THE PRINCIPAL",null,null,{"$f":"'teacher-wise time-table'!$N$2","v":"TTL PERIODS PER WEEK"},{"$f":"VLOOKUP(E16,'teacher-wise time-table'!$A$5:$N$106,14)","v":32}]
[{"$f":"'teacher-wise time-table'!$B$1","v":"GOVT. GIRLS' HR. SEC. SCHOOL, NIMBAHERA,                                                  TEACHER-WISE TIME TABLE FOR THE YEAR 2014-15"},null,null,null,{"$f":"E16+3","v":7}]
[]
[{"$f":"'teacher-wise time-table'!$D$3","v":"SUMMER TIMINGS"},{"$f":"'teacher-wise time-table'!$D$4","v":"WINTER TIMINGS"},{"$f":"'teacher-wise time-table'!$D$2","v":"PERIOD"},{"$f":"VLOOKUP(E31,'teacher-wise time-table'!$A$5:$N$106,2)","v":"VACANT POST 1"},{"$f":"VLOOKUP(E31,'teacher-wise time-table'!$A$5:$N$106,3)","v":"LECTURER, PHYSICS "}]
[]
[{"$f":"'teacher-wise time-table'!$B$3","v":"7:00-7:20"},{"$f":"'teacher-wise time-table'!$B$4","v":"7:30-7:50"},{"$f":"'teacher-wise time-table'!$B$2","v":"PRAYER"},{"$f":"VLOOKUP(E31,'teacher-wise time-table'!$A$5:$N$106,4)","v":0}]
[{"$f":"'teacher-wise time-table'!$E$3","v":"07:20-07:55"},{"$f":"'teacher-wise time-table'!$E$4","v":"07:50-08:25"},{"$f":"'teacher-wise time-table'!$E$2","v":1},{"$f":"VLOOKUP(E31,'teacher-wise time-table'!$A$5:$N$106,5)","v":"11th D "},{"$f":"VLOOKUP(E31+1,'teacher-wise time-table'!$A$5:$N$106,5)","v":"PHYSICS 1 TO 6"}]
[{"$f":"'teacher-wise time-table'!$F$3","v":"07:55-08:30"},{"$f":"'teacher-wise time-table'!$F$4","v":"08:25-08:55"},{"$f":"'teacher-wise time-table'!$F$2","v":2},{"$f":"VLOOKUP(E31,'teacher-wise time-table'!$A$5:$N$106,6)","v":"12th D"},{"$f":"VLOOKUP(E31+1,'teacher-wise time-table'!$A$5:$N$106,6)","v":"PHYSICS 1 TO 6"}]
[{"$f":"'teacher-wise time-table'!$G$3","v":"08:30-09:05"},{"$f":"'teacher-wise time-table'!$G$4","v":"08:55-09:25"},{"$f":"'teacher-wise time-table'!$G$2","v":3},{"$f":"VLOOKUP(E31,'teacher-wise time-table'!$A$5:$N$106,7)","v":0},{"$f":"VLOOKUP(E31+1,'teacher-wise time-table'!$A$5:$N$106,7)","v":0}]
[{"$f":"'teacher-wise time-table'!$H$3","v":"09:05-09:40"},{"$f":"'teacher-wise time-table'!$H$4","v":"09:25-09:55"},{"$f":"'teacher-wise time-table'!$H$2","v":4},{"$f":"VLOOKUP(E31,'teacher-wise time-table'!$A$5:$N$106,8)","v":"12th D "},{"$f":"VLOOKUP(E31+1,'teacher-wise time-table'!$A$5:$N$106,8)","v":"PHYSICS 5,6"}]
[{"$f":"'teacher-wise time-table'!$I$6","v":"09:40-10:10         "},{"$f":"'teacher-wise time-table'!$I$11","v":"09:55-10:25"},{"$f":"'teacher-wise time-table'!$I$2","v":" BREAK      "}]
[{"$f":"'teacher-wise time-table'!$J$3","v":"10:10-10:45"},{"$f":"'teacher-wise time-table'!$J$4","v":"10:25-10:55"},{"$f":"'teacher-wise time-table'!$J$2","v":5},{"$f":"VLOOKUP(E31,'teacher-wise time-table'!$A$5:$N$106,10)","v":"12th D PHY. PR."},{"$f":"VLOOKUP(E31+1,'teacher-wise time-table'!$A$5:$N$106,10)","v":" D1 5,6  D2 1,2"}]
[{"$f":"'teacher-wise time-table'!$K$3","v":"10:45-11:20"},{"$f":"'teacher-wise time-table'!$K$4","v":"10:55-11:25"},{"$f":"'teacher-wise time-table'!$K$2","v":6},{"$f":"VLOOKUP(E31,'teacher-wise time-table'!$A$5:$N$106,11)","v":"12th D PHY. PR."},{"$f":"VLOOKUP(E31+1,'teacher-wise time-table'!$A$5:$N$106,11)","v":" D1 5,6  D2 1,2"}]
[{"$f":"'teacher-wise time-table'!$L$3","v":"11:20-11:55"},{"$f":"'teacher-wise time-table'!$L$4","v":"11:25-11:55"},{"$f":"'teacher-wise time-table'!$L$2","v":7},{"$f":"VLOOKUP(E31,'teacher-wise time-table'!$A$5:$N$106,12)","v":"11th D PHY. PR."},{"$f":"VLOOKUP(E31+1,'teacher-wise time-table'!$A$5:$N$106,12)","v":" D1 1,2  D2 3,4"}]
[{"$f":"'teacher-wise time-table'!$M$3","v":"11:55-12:25"},{"$f":"'teacher-wise time-table'!$M$4","v":"11:55-12:25"},{"$f":"'teacher-wise time-table'!$M$2","v":8},{"$f":"VLOOKUP(E31,'teacher-wise time-table'!$A$5:$N$106,13)","v":"11th D PHY. PR."},{"$f":"VLOOKUP(E31+1,'teacher-wise time-table'!$A$5:$N$106,13)","v":" D1 1,2  D2 3,4"}]
["SIGN. OF THE PRINCIPAL",null,null,{"$f":"'teacher-wise time-table'!$N$2","v":"TTL PERIODS PER WEEK"},{"$f":"VLOOKUP(E31,'teacher-wise time-table'!$A$5:$N$106,14)","v":30}]
[{"$f":"'teacher-wise time-table'!$B$1","v":"GOVT. GIRLS' HR. SEC. SCHOOL, NIMBAHERA,                                                  TEACHER-WISE TIME TABLE FOR THE YEAR 2014-15"},null,null,null,{"$f":"E31+3","v":10}]
[]
[{"$f":"'teacher-wise time-table'!$D$3","v":"SUMMER TIMINGS"},{"$f":"'teacher-wise time-table'!$D$4","v":"WINTER TIMINGS"},{"$f":"'teacher-wise time-table'!$D$2","v":"PERIOD"},{"$f":"VLOOKUP(E46,'teacher-wise time-table'!$A$5:$N$106,2)","v":"MR. C"},{"$f":"VLOOKUP(E46,'teacher-wise time-table'!$A$5:$N$106,3)","v":"LECTURER, ENGLISH "}]
[]
[{"$f":"'teacher-wise time-table'!$B$3","v":"7:00-7:20"},{"$f":"'teacher-wise time-table'!$B$4","v":"7:30-7:50"},{"$f":"'teacher-wise time-table'!$B$2","v":"PRAYER"},{"$f":"VLOOKUP(E46,'teacher-wise time-table'!$A$5:$N$106,4)","v":"FIRST ASSISTANT, LOCAL EXAM.. TIME TABLE INCHARGE, STATE . ICT CO-ORDINATOR"}]
[{"$f":"'teacher-wise time-table'!$E$3","v":"07:20-07:55"},{"$f":"'teacher-wise time-table'!$E$4","v":"07:50-08:25"},{"$f":"'teacher-wise time-table'!$E$2","v":1},{"$f":"VLOOKUP(E46,'teacher-wise time-table'!$A$5:$N$106,5)","v":"12th C"},{"$f":"VLOOKUP(E46+1,'teacher-wise time-table'!$A$5:$N$106,5)","v":"ENGLISH 1 TO 6"}]
[{"$f":"'teacher-wise time-table'!$F$3","v":"07:55-08:30"},{"$f":"'teacher-wise time-table'!$F$4","v":"08:25-08:55"},{"$f":"'teacher-wise time-table'!$F$2","v":2},{"$f":"VLOOKUP(E46,'teacher-wise time-table'!$A$5:$N$106,6)","v":"12th B"},{"$f":"VLOOKUP(E46+1,'teacher-wise time-table'!$A$5:$N$106,6)","v":"ENGLISH 1 TO 6"}]
[{"$f":"'teacher-wise time-table'!$G$3","v":"08:30-09:05"},{"$f":"'teacher-wise time-table'!$G$4","v":"08:55-09:25"},{"$f":"'teacher-wise time-table'!$G$2","v":3},{"$f":"VLOOKUP(E46,'teacher-wise time-table'!$A$5:$N$106,7)","v":0},{"$f":"VLOOKUP(E46+1,'teacher-wise time-table'!$A$5:$N$106,7)","v":0}]
[{"$f":"'teacher-wise time-table'!$H$3","v":"09:05-09:40"},{"$f":"'teacher-wise time-table'!$H$4","v":"09:25-09:55"},{"$f":"'teacher-wise time-table'!$H$2","v":4},{"$f":"VLOOKUP(E46,'teacher-wise time-table'!$A$5:$N$106,8)","v":"12th A"},{"$f":"VLOOKUP(E46+1,'teacher-wise time-table'!$A$5:$N$106,8)","v":"ENGLISH 1 TO 6"}]
[{"$f":"'teacher-wise time-table'!$I$6","v":"09:40-10:10         "},{"$f":"'teacher-wise time-table'!$I$11","v":"09:55-10:25"},{"$f":"'teacher-wise time-table'!$I$2","v":" BREAK      "}]
[{"$f":"'teacher-wise time-table'!$J$3","v":"10:10-10:45"},{"$f":"'teacher-wise time-table'!$J$4","v":"10:25-10:55"},{"$f":"'teacher-wise time-table'!$J$2","v":5},{"$f":"VLOOKUP(E46,'teacher-wise time-table'!$A$5:$N$106,10)","v":"12th E "},{"$f":"VLOOKUP(E46+1,'teacher-wise time-table'!$A$5:$N$106,10)","v":"ENGLISH 1 TO 6"}]
[{"$f":"'teacher-wise time-table'!$K$3","v":"10:45-11:20"},{"$f":"'teacher-wise time-table'!$K$4","v":"10:55-11:25"},{"$f":"'teacher-wise time-table'!$K$2","v":6},{"$f":"VLOOKUP(E46,'teacher-wise time-table'!$A$5:$N$106,11)","v":0},{"$f":"VLOOKUP(E46+1,'teacher-wise time-table'!$A$5:$N$106,11)","v":0}]
[{"$f":"'teacher-wise time-table'!$L$3","v":"11:20-11:55"},{"$f":"'teacher-wise time-table'!$L$4","v":"11:25-11:55"},{"$f":"'teacher-wise time-table'!$L$2","v":7},{"$f":"VLOOKUP(E46,'teacher-wise time-table'!$A$5:$N$106,12)","v":"12th D "},{"$f":"VLOOKUP(E46+1,'teacher-wise time-table'!$A$5:$N$106,12)","v":"ENGLISH 1 TO 6"}]
[{"$f":"'teacher-wise time-table'!$M$3","v":"11:55-12:25"},{"$f":"'teacher-wise time-table'!$M$4","v":"11:55-12:25"},{"$f":"'teacher-wise time-table'!$M$2","v":8},{"$f":"VLOOKUP(E46,'teacher-wise time-table'!$A$5:$N$106,13)","v":0},{"$f":"VLOOKUP(E46+1,'teacher-wise time-table'!$A$5:$N$106,13)","v":0}]
["SIGN. OF THE PRINCIPAL",null,null,{"$f":"'teacher-wise time-table'!$N$2","v":"TTL PERIODS PER WEEK"},{"$f":"VLOOKUP(E46,'teacher-wise time-table'!$A$5:$N$106,14)","v":30}]
[{"$f":"'teacher-wise time-table'!$B$1","v":"GOVT. GIRLS' HR. SEC. SCHOOL, NIMBAHERA,                                                  TEACHER-WISE TIME TABLE FOR THE YEAR 2014-15"},null,null,null,{"$f":"E46+3","v":13}]
[]
[{"$f":"'teacher-wise time-table'!$D$3","v":"SUMMER TIMINGS"},{"$f":"'teacher-wise time-table'!$D$4","v":"WINTER TIMINGS"},{"$f":"'teacher-wise time-table'!$D$2","v":"PERIOD"},{"$f":"VLOOKUP(E61,'teacher-wise time-table'!$A$5:$N$106,2)","v":"MR. D"},{"$f":"VLOOKUP(E61,'teacher-wise time-table'!$A$5:$N$106,3)","v":"G. LECTURER, ENGLISH"}]
[]
[{"$f":"'teacher-wise time-table'!$B$3","v":"7:00-7:20"},{"$f":"'teacher-wise time-table'!$B$4","v":"7:30-7:50"},{"$f":"'teacher-wise time-table'!$B$2","v":"PRAYER"},{"$f":"VLOOKUP(E61,'teacher-wise time-table'!$A$5:$N$106,4)","v":"CT 12 E"}]
[{"$f":"'teacher-wise time-table'!$E$3","v":"07:20-07:55"},{"$f":"'teacher-wise time-table'!$E$4","v":"07:50-08:25"},{"$f":"'teacher-wise time-table'!$E$2","v":1},{"$f":"VLOOKUP(E61,'teacher-wise time-table'!$A$5:$N$106,5)","v":0},{"$f":"VLOOKUP(E61+1,'teacher-wise time-table'!$A$5:$N$106,5)","v":0}]
[{"$f":"'teacher-wise time-table'!$F$3","v":"07:55-08:30"},{"$f":"'teacher-wise time-table'!$F$4","v":"08:25-08:55"},{"$f":"'teacher-wise time-table'!$F$2","v":2},{"$f":"VLOOKUP(E61,'teacher-wise time-table'!$A$5:$N$106,6)","v":0},{"$f":"VLOOKUP(E61+1,'teacher-wise time-table'!$A$5:$N$106,6)","v":0}]
[{"$f":"'teacher-wise time-table'!$G$3","v":"08:30-09:05"},{"$f":"'teacher-wise time-table'!$G$4","v":"08:55-09:25"},{"$f":"'teacher-wise time-table'!$G$2","v":3},{"$f":"VLOOKUP(E61,'teacher-wise time-table'!$A$5:$N$106,7)","v":"11th C+B"},{"$f":"VLOOKUP(E61+1,'teacher-wise time-table'!$A$5:$N$106,7)","v":"ENGLISH 1 TO 6"}]
[{"$f":"'teacher-wise time-table'!$H$3","v":"09:05-09:40"},{"$f":"'teacher-wise time-table'!$H$4","v":"09:25-09:55"},{"$f":"'teacher-wise time-table'!$H$2","v":4},{"$f":"VLOOKUP(E61,'teacher-wise time-table'!$A$5:$N$106,8)","v":"11th E+A"},{"$f":"VLOOKUP(E61+1,'teacher-wise time-table'!$A$5:$N$106,8)","v":"ENGLISH 1 TO 6"}]
[{"$f":"'teacher-wise time-table'!$I$6","v":"09:40-10:10         "},{"$f":"'teacher-wise time-table'!$I$11","v":"09:55-10:25"},{"$f":"'teacher-wise time-table'!$I$2","v":" BREAK      "}]
[{"$f":"'teacher-wise time-table'!$J$3","v":"10:10-10:45"},{"$f":"'teacher-wise time-table'!$J$4","v":"10:25-10:55"},{"$f":"'teacher-wise time-table'!$J$2","v":5},{"$f":"VLOOKUP(E61,'teacher-wise time-table'!$A$5:$N$106,10)","v":0},{"$f":"VLOOKUP(E61+1,'teacher-wise time-table'!$A$5:$N$106,10)","v":0}]
[{"$f":"'teacher-wise time-table'!$K$3","v":"10:45-11:20"},{"$f":"'teacher-wise time-table'!$K$4","v":"10:55-11:25"},{"$f":"'teacher-wise time-table'!$K$2","v":6},{"$f":"VLOOKUP(E61,'teacher-wise time-table'!$A$5:$N$106,11)","v":"11th D"},{"$f":"VLOOKUP(E61+1,'teacher-wise time-table'!$A$5:$N$106,11)","v":"ENGLISH 1 TO 6"}]
[{"$f":"'teacher-wise time-table'!$L$3","v":"11:20-11:55"},{"$f":"'teacher-wise time-table'!$L$4","v":"11:25-11:55"},{"$f":"'teacher-wise time-table'!$L$2","v":7},{"$f":"VLOOKUP(E61,'teacher-wise time-table'!$A$5:$N$106,12)","v":0},{"$f":"VLOOKUP(E61+1,'teacher-wise time-table'!$A$5:$N$106,12)","v":0}]
[{"$f":"'teacher-wise time-table'!$M$3","v":"11:55-12:25"},{"$f":"'teacher-wise time-table'!$M$4","v":"11:55-12:25"},{"$f":"'teacher-wise time-table'!$M$2","v":8},{"$f":"VLOOKUP(E61,'teacher-wise time-table'!$A$5:$N$106,13)","v":0},{"$f":"VLOOKUP(E61+1,'teacher-wise time-table'!$A$5:$N$106,13)","v":0}]
["SIGN. OF THE PRINCIPAL",null,null,{"$f":"'teacher-wise time-table'!$N$2","v":"TTL PERIODS PER WEEK"},{"$f":"VLOOKUP(E61,'teacher-wise time-table'!$A$5:$N$106,14)","v":18}]
[{"$f":"'teacher-wise time-table'!$B$1","v":"GOVT. GIRLS' HR. SEC. SCHOOL, NIMBAHERA,                                                  TEACHER-WISE TIME TABLE FOR THE YEAR 2014-15"},null,null,null,{"$f":"E61+3","v":16}]
[]
[{"$f":"'teacher-wise time-table'!$D$3","v":"SUMMER TIMINGS"},{"$f":"'teacher-wise time-table'!$D$4","v":"WINTER TIMINGS"},{"$f":"'teacher-wise time-table'!$D$2","v":"PERIOD"},{"$f":"VLOOKUP(E76,'teacher-wise time-table'!$A$5:$N$106,2)","v":"MR. E"},{"$f":"VLOOKUP(E76,'teacher-wise time-table'!$A$5:$N$106,3)","v":"LECTURER, HINDI "}]
[]
[{"$f":"'teacher-wise time-table'!$B$3","v":"7:00-7:20"},{"$f":"'teacher-wise time-table'!$B$4","v":"7:30-7:50"},{"$f":"'teacher-wise time-table'!$B$2","v":"PRAYER"},{"$f":"VLOOKUP(E76,'teacher-wise time-table'!$A$5:$N$106,4)","v":"SECRETARY SDMC,                    CT 11 B"}]
[{"$f":"'teacher-wise time-table'!$E$3","v":"07:20-07:55"},{"$f":"'teacher-wise time-table'!$E$4","v":"07:50-08:25"},{"$f":"'teacher-wise time-table'!$E$2","v":1},{"$f":"VLOOKUP(E76,'teacher-wise time-table'!$A$5:$N$106,5)","v":"11th C+B"},{"$f":"VLOOKUP(E76+1,'teacher-wise time-table'!$A$5:$N$106,5)","v":"HINDI COM. 1 TO 6"}]
[{"$f":"'teacher-wise time-table'!$F$3","v":"07:55-08:30"},{"$f":"'teacher-wise time-table'!$F$4","v":"08:25-08:55"},{"$f":"'teacher-wise time-table'!$F$2","v":2},{"$f":"VLOOKUP(E76,'teacher-wise time-table'!$A$5:$N$106,6)","v":0},{"$f":"VLOOKUP(E76+1,'teacher-wise time-table'!$A$5:$N$106,6)","v":0}]
[{"$f":"'teacher-wise time-table'!$G$3","v":"08:30-09:05"},{"$f":"'teacher-wise time-table'!$G$4","v":"08:55-09:25"},{"$f":"'teacher-wise time-table'!$G$2","v":3},{"$f":"VLOOKUP(E76,'teacher-wise time-table'!$A$5:$N$106,7)","v":"12th A"},{"$f":"VLOOKUP(E76+1,'teacher-wise time-table'!$A$5:$N$106,7)","v":"HINDI LIT. 1 TO 6"}]
[{"$f":"'teacher-wise time-table'!$H$3","v":"09:05-09:40"},{"$f":"'teacher-wise time-table'!$H$4","v":"09:25-09:55"},{"$f":"'teacher-wise time-table'!$H$2","v":4},{"$f":"VLOOKUP(E76,'teacher-wise time-table'!$A$5:$N$106,8)","v":"12th C O"},{"$f":"VLOOKUP(E76+1,'teacher-wise time-table'!$A$5:$N$106,8)","v":" HINDI COM. 1 TO 6"}]
[{"$f":"'teacher-wise time-table'!$I$6","v":"09:40-10:10         "},{"$f":"'teacher-wise time-table'!$I$11","v":"09:55-10:25"},{"$f":"'teacher-wise time-table'!$I$2","v":" BREAK      "}]
[{"$f":"'teacher-wise time-table'!$J$3","v":"10:10-10:45"},{"$f":"'teacher-wise time-table'!$J$4","v":"10:25-10:55"},{"$f":"'teacher-wise time-table'!$J$2","v":5},{"$f":"VLOOKUP(E76,'teacher-wise time-table'!$A$5:$N$106,10)","v":"11th D"},{"$f":"VLOOKUP(E76+1,'teacher-wise time-table'!$A$5:$N$106,10)","v":"HINDI  1 TO 6"}]
[{"$f":"'teacher-wise time-table'!$K$3","v":"10:45-11:20"},{"$f":"'teacher-wise time-table'!$K$4","v":"10:55-11:25"},{"$f":"'teacher-wise time-table'!$K$2","v":6},{"$f":"VLOOKUP(E76,'teacher-wise time-table'!$A$5:$N$106,11)","v":0},{"$f":"VLOOKUP(E76+1,'teacher-wise time-table'!$A$5:$N$106,11)","v":0}]
[{"$f":"'teacher-wise time-table'!$L$3","v":"11:20-11:55"},{"$f":"'teacher-wise time-table'!$L$4","v":"11:25-11:55"},{"$f":"'teacher-wise time-table'!$L$2","v":7},{"$f":"VLOOKUP(E76,'teacher-wise time-table'!$A$5:$N$106,12)","v":"11th E+A"},{"$f":"VLOOKUP(E76+1,'teacher-wise time-table'!$A$5:$N$106,12)","v":"HINDI  1 TO 6"}]
[{"$f":"'teacher-wise time-table'!$M$3","v":"11:55-12:25"},{"$f":"'teacher-wise time-table'!$M$4","v":"11:55-12:25"},{"$f":"'teacher-wise time-table'!$M$2","v":8},{"$f":"VLOOKUP(E76,'teacher-wise time-table'!$A$5:$N$106,13)","v":"12th E+A"},{"$f":"VLOOKUP(E76+1,'teacher-wise time-table'!$A$5:$N$106,13)","v":"HINDI LIT.1-3,5,6"}]
["SIGN. OF THE PRINCIPAL",null,null,{"$f":"'teacher-wise time-table'!$N$2","v":"TTL PERIODS PER WEEK"},{"$f":"VLOOKUP(E76,'teacher-wise time-table'!$A$5:$N$106,14)","v":"29+6"}]
[{"$f":"'teacher-wise time-table'!$B$1","v":"GOVT. GIRLS' HR. SEC. SCHOOL, NIMBAHERA,                                                  TEACHER-WISE TIME TABLE FOR THE YEAR 2014-15"},null,null,null,{"$f":"E76+3","v":19}]
[]
[{"$f":"'teacher-wise time-table'!$D$3","v":"SUMMER TIMINGS"},{"$f":"'teacher-wise time-table'!$D$4","v":"WINTER TIMINGS"},{"$f":"'teacher-wise time-table'!$D$2","v":"PERIOD"},{"$f":"VLOOKUP(E91,'teacher-wise time-table'!$A$5:$N$106,2)","v":"MR. F"},{"$f":"VLOOKUP(E91,'teacher-wise time-table'!$A$5:$N$106,3)","v":"LECTURER , HINDI"}]
[]
[{"$f":"'teacher-wise time-table'!$B$3","v":"7:00-7:20"},{"$f":"'teacher-wise time-table'!$B$4","v":"7:30-7:50"},{"$f":"'teacher-wise time-table'!$B$2","v":"PRAYER"},{"$f":"VLOOKUP(E91,'teacher-wise time-table'!$A$5:$N$106,4)","v":"PYAYER ASSEMBLY, G.K., CT 12 A"}]
[{"$f":"'teacher-wise time-table'!$E$3","v":"07:20-07:55"},{"$f":"'teacher-wise time-table'!$E$4","v":"07:50-08:25"},{"$f":"'teacher-wise time-table'!$E$2","v":1},{"$f":"VLOOKUP(E91,'teacher-wise time-table'!$A$5:$N$106,5)","v":"12th E+A"},{"$f":"VLOOKUP(E91+1,'teacher-wise time-table'!$A$5:$N$106,5)","v":" HINDI COM. 1 TO 6"}]
[{"$f":"'teacher-wise time-table'!$F$3","v":"07:55-08:30"},{"$f":"'teacher-wise time-table'!$F$4","v":"08:25-08:55"},{"$f":"'teacher-wise time-table'!$F$2","v":2},{"$f":"VLOOKUP(E91,'teacher-wise time-table'!$A$5:$N$106,6)","v":"11th E+A"},{"$f":"VLOOKUP(E91+1,'teacher-wise time-table'!$A$5:$N$106,6)","v":" HINDI LIT. 1 TO 6"}]
[{"$f":"'teacher-wise time-table'!$G$3","v":"08:30-09:05"},{"$f":"'teacher-wise time-table'!$G$4","v":"08:55-09:25"},{"$f":"'teacher-wise time-table'!$G$2","v":3},{"$f":"VLOOKUP(E91,'teacher-wise time-table'!$A$5:$N$106,7)","v":"12th E"},{"$f":"VLOOKUP(E91+1,'teacher-wise time-table'!$A$5:$N$106,7)","v":"HINDI LIT. 1 TO 6"}]
[{"$f":"'teacher-wise time-table'!$H$3","v":"09:05-09:40"},{"$f":"'teacher-wise time-table'!$H$4","v":"09:25-09:55"},{"$f":"'teacher-wise time-table'!$H$2","v":4},{"$f":"VLOOKUP(E91,'teacher-wise time-table'!$A$5:$N$106,8)","v":"12th B"},{"$f":"VLOOKUP(E91+1,'teacher-wise time-table'!$A$5:$N$106,8)","v":" HINDI COM. 1 TO 6"}]
[{"$f":"'teacher-wise time-table'!$I$6","v":"09:40-10:10         "},{"$f":"'teacher-wise time-table'!$I$11","v":"09:55-10:25"},{"$f":"'teacher-wise time-table'!$I$2","v":" BREAK      "}]
[{"$f":"'teacher-wise time-table'!$J$3","v":"10:10-10:45"},{"$f":"'teacher-wise time-table'!$J$4","v":"10:25-10:55"},{"$f":"'teacher-wise time-table'!$J$2","v":5},{"$f":"VLOOKUP(E91,'teacher-wise time-table'!$A$5:$N$106,10)","v":0},{"$f":"VLOOKUP(E91+1,'teacher-wise time-table'!$A$5:$N$106,10)","v":0}]
[{"$f":"'teacher-wise time-table'!$K$3","v":"10:45-11:20"},{"$f":"'teacher-wise time-table'!$K$4","v":"10:55-11:25"},{"$f":"'teacher-wise time-table'!$K$2","v":6},{"$f":"VLOOKUP(E91,'teacher-wise time-table'!$A$5:$N$106,11)","v":"11th E+A"},{"$f":"VLOOKUP(E91+1,'teacher-wise time-table'!$A$5:$N$106,11)","v":" HINDI LIT. 3 TO 6"}]
[{"$f":"'teacher-wise time-table'!$L$3","v":"11:20-11:55"},{"$f":"'teacher-wise time-table'!$L$4","v":"11:25-11:55"},{"$f":"'teacher-wise time-table'!$L$2","v":7},{"$f":"VLOOKUP(E91,'teacher-wise time-table'!$A$5:$N$106,12)","v":0},{"$f":"VLOOKUP(E91+1,'teacher-wise time-table'!$A$5:$N$106,12)","v":0}]
[{"$f":"'teacher-wise time-table'!$M$3","v":"11:55-12:25"},{"$f":"'teacher-wise time-table'!$M$4","v":"11:55-12:25"},{"$f":"'teacher-wise time-table'!$M$2","v":8},{"$f":"VLOOKUP(E91,'teacher-wise time-table'!$A$5:$N$106,13)","v":"12th D"},{"$f":"VLOOKUP(E91+1,'teacher-wise time-table'!$A$5:$N$106,13)","v":" HINDI 1 TO 6"}]
["SIGN. OF THE PRINCIPAL",null,null,{"$f":"'teacher-wise time-table'!$N$2","v":"TTL PERIODS PER WEEK"},{"$f":"VLOOKUP(E91,'teacher-wise time-table'!$A$5:$N$106,14)","v":"29+6"}]
[{"$f":"'teacher-wise time-table'!$B$1","v":"GOVT. GIRLS' HR. SEC. SCHOOL, NIMBAHERA,                                                  TEACHER-WISE TIME TABLE FOR THE YEAR 2014-15"},null,null,null,{"$f":"E91+3","v":22}]
[]
[{"$f":"'teacher-wise time-table'!$D$3","v":"SUMMER TIMINGS"},{"$f":"'teacher-wise time-table'!$D$4","v":"WINTER TIMINGS"},{"$f":"'teacher-wise time-table'!$D$2","v":"PERIOD"},{"$f":"VLOOKUP(E106,'teacher-wise time-table'!$A$5:$N$106,2)","v":"MR. G"},{"$f":"VLOOKUP(E106,'teacher-wise time-table'!$A$5:$N$106,3)","v":"LECTURER , HISTORY"}]
[]
[{"$f":"'teacher-wise time-table'!$B$3","v":"7:00-7:20"},{"$f":"'teacher-wise time-table'!$B$4","v":"7:30-7:50"},{"$f":"'teacher-wise time-table'!$B$2","v":"PRAYER"},{"$f":"VLOOKUP(E106,'teacher-wise time-table'!$A$5:$N$106,4)","v":"SCHOOL PLAN, HERITAGE CLUC+BT 12 B"}]
[{"$f":"'teacher-wise time-table'!$E$3","v":"07:20-07:55"},{"$f":"'teacher-wise time-table'!$E$4","v":"07:50-08:25"},{"$f":"'teacher-wise time-table'!$E$2","v":1},{"$f":"VLOOKUP(E106,'teacher-wise time-table'!$A$5:$N$106,5)","v":"12th B"},{"$f":"VLOOKUP(E106+1,'teacher-wise time-table'!$A$5:$N$106,5)","v":"HISTORY 1 TO 6"}]
[{"$f":"'teacher-wise time-table'!$F$3","v":"07:55-08:30"},{"$f":"'teacher-wise time-table'!$F$4","v":"08:25-08:55"},{"$f":"'teacher-wise time-table'!$F$2","v":2},{"$f":"VLOOKUP(E106,'teacher-wise time-table'!$A$5:$N$106,6)","v":"12th C"},{"$f":"VLOOKUP(E106+1,'teacher-wise time-table'!$A$5:$N$106,6)","v":"HISTORY 1 TO 6"}]
[{"$f":"'teacher-wise time-table'!$G$3","v":"08:30-09:05"},{"$f":"'teacher-wise time-table'!$G$4","v":"08:55-09:25"},{"$f":"'teacher-wise time-table'!$G$2","v":3},{"$f":"VLOOKUP(E106,'teacher-wise time-table'!$A$5:$N$106,7)","v":0},{"$f":"VLOOKUP(E106+1,'teacher-wise time-table'!$A$5:$N$106,7)","v":0}]
[{"$f":"'teacher-wise time-table'!$H$3","v":"09:05-09:40"},{"$f":"'teacher-wise time-table'!$H$4","v":"09:25-09:55"},{"$f":"'teacher-wise time-table'!$H$2","v":4},{"$f":"VLOOKUP(E106,'teacher-wise time-table'!$A$5:$N$106,8)","v":"11th C+B"},{"$f":"VLOOKUP(E106+1,'teacher-wise time-table'!$A$5:$N$106,8)","v":"HISTORY 1 TO 6"}]
[{"$f":"'teacher-wise time-table'!$I$6","v":"09:40-10:10         "},{"$f":"'teacher-wise time-table'!$I$11","v":"09:55-10:25"},{"$f":"'teacher-wise time-table'!$I$2","v":" BREAK      "}]
[{"$f":"'teacher-wise time-table'!$J$3","v":"10:10-10:45"},{"$f":"'teacher-wise time-table'!$J$4","v":"10:25-10:55"},{"$f":"'teacher-wise time-table'!$J$2","v":5},{"$f":"VLOOKUP(E106,'teacher-wise time-table'!$A$5:$N$106,10)","v":"11th C+B "},{"$f":"VLOOKUP(E106+1,'teacher-wise time-table'!$A$5:$N$106,10)","v":"HISTORY 3 TO 6"}]
[{"$f":"'teacher-wise time-table'!$K$3","v":"10:45-11:20"},{"$f":"'teacher-wise time-table'!$K$4","v":"10:55-11:25"},{"$f":"'teacher-wise time-table'!$K$2","v":6},{"$f":"VLOOKUP(E106,'teacher-wise time-table'!$A$5:$N$106,11)","v":"12th C "},{"$f":"VLOOKUP(E106+1,'teacher-wise time-table'!$A$5:$N$106,11)","v":"HISTORY 1 TO 5"}]
[{"$f":"'teacher-wise time-table'!$L$3","v":"11:20-11:55"},{"$f":"'teacher-wise time-table'!$L$4","v":"11:25-11:55"},{"$f":"'teacher-wise time-table'!$L$2","v":7},{"$f":"VLOOKUP(E106,'teacher-wise time-table'!$A$5:$N$106,12)","v":0},{"$f":"VLOOKUP(E106+1,'teacher-wise time-table'!$A$5:$N$106,12)","v":0}]
[{"$f":"'teacher-wise time-table'!$M$3","v":"11:55-12:25"},{"$f":"'teacher-wise time-table'!$M$4","v":"11:55-12:25"},{"$f":"'teacher-wise time-table'!$M$2","v":8},{"$f":"VLOOKUP(E106,'teacher-wise time-table'!$A$5:$N$106,13)","v":"12th B"},{"$f":"VLOOKUP(E106+1,'teacher-wise time-table'!$A$5:$N$106,13)","v":"HISTORY 1,3-6"}]
["SIGN. OF THE PRINCIPAL",null,null,{"$f":"'teacher-wise time-table'!$N$2","v":"TTL PERIODS PER WEEK"},{"$f":"VLOOKUP(E106,'teacher-wise time-table'!$A$5:$N$106,14)","v":"29+5"}]
[{"$f":"'teacher-wise time-table'!$B$1","v":"GOVT. GIRLS' HR. SEC. SCHOOL, NIMBAHERA,                                                  TEACHER-WISE TIME TABLE FOR THE YEAR 2014-15"},null,null,null,{"$f":"E106+3","v":25}]
[]
[{"$f":"'teacher-wise time-table'!$D$3","v":"SUMMER TIMINGS"},{"$f":"'teacher-wise time-table'!$D$4","v":"WINTER TIMINGS"},{"$f":"'teacher-wise time-table'!$D$2","v":"PERIOD"},{"$f":"VLOOKUP(E121,'teacher-wise time-table'!$A$5:$N$106,2)","v":"MR. H"},{"$f":"VLOOKUP(E121,'teacher-wise time-table'!$A$5:$N$106,3)","v":"LECTURER, POL. SCIENCE "}]
[]
[{"$f":"'teacher-wise time-table'!$B$3","v":"7:00-7:20"},{"$f":"'teacher-wise time-table'!$B$4","v":"7:30-7:50"},{"$f":"'teacher-wise time-table'!$B$2","v":"PRAYER"},{"$f":"VLOOKUP(E121,'teacher-wise time-table'!$A$5:$N$106,4)","v":"STUDENT WELFARE COMMISSION            CT 11 A"}]
[{"$f":"'teacher-wise time-table'!$E$3","v":"07:20-07:55"},{"$f":"'teacher-wise time-table'!$E$4","v":"07:50-08:25"},{"$f":"'teacher-wise time-table'!$E$2","v":1},{"$f":"VLOOKUP(E121,'teacher-wise time-table'!$A$5:$N$106,5)","v":"11th A"},{"$f":"VLOOKUP(E121+1,'teacher-wise time-table'!$A$5:$N$106,5)","v":"POL. SC. 1 TO 6"}]
[{"$f":"'teacher-wise time-table'!$F$3","v":"07:55-08:30"},{"$f":"'teacher-wise time-table'!$F$4","v":"08:25-08:55"},{"$f":"'teacher-wise time-table'!$F$2","v":2},{"$f":"VLOOKUP(E121,'teacher-wise time-table'!$A$5:$N$106,6)","v":"12th A"},{"$f":"VLOOKUP(E121+1,'teacher-wise time-table'!$A$5:$N$106,6)","v":"POL. SC. 1 TO 6"}]
[{"$f":"'teacher-wise time-table'!$G$3","v":"08:30-09:05"},{"$f":"'teacher-wise time-table'!$G$4","v":"08:55-09:25"},{"$f":"'teacher-wise time-table'!$G$2","v":3},{"$f":"VLOOKUP(E121,'teacher-wise time-table'!$A$5:$N$106,7)","v":0},{"$f":"VLOOKUP(E121+1,'teacher-wise time-table'!$A$5:$N$106,7)","v":0}]
[{"$f":"'teacher-wise time-table'!$H$3","v":"09:05-09:40"},{"$f":"'teacher-wise time-table'!$H$4","v":"09:25-09:55"},{"$f":"'teacher-wise time-table'!$H$2","v":4},{"$f":"VLOOKUP(E121,'teacher-wise time-table'!$A$5:$N$106,8)","v":0},{"$f":"VLOOKUP(E121+1,'teacher-wise time-table'!$A$5:$N$106,8)","v":0}]
[{"$f":"'teacher-wise time-table'!$I$6","v":"09:40-10:10         "},{"$f":"'teacher-wise time-table'!$I$11","v":"09:55-10:25"},{"$f":"'teacher-wise time-table'!$I$2","v":" BREAK      "}]
[{"$f":"'teacher-wise time-table'!$J$3","v":"10:10-10:45"},{"$f":"'teacher-wise time-table'!$J$4","v":"10:25-10:55"},{"$f":"'teacher-wise time-table'!$J$2","v":5},{"$f":"VLOOKUP(E121,'teacher-wise time-table'!$A$5:$N$106,10)","v":"12th B"},{"$f":"VLOOKUP(E121+1,'teacher-wise time-table'!$A$5:$N$106,10)","v":"POL. SC. 1 TO 6"}]
[{"$f":"'teacher-wise time-table'!$K$3","v":"10:45-11:20"},{"$f":"'teacher-wise time-table'!$K$4","v":"10:55-11:25"},{"$f":"'teacher-wise time-table'!$K$2","v":6},{"$f":"VLOOKUP(E121,'teacher-wise time-table'!$A$5:$N$106,11)","v":"12th A"},{"$f":"VLOOKUP(E121+1,'teacher-wise time-table'!$A$5:$N$106,11)","v":"POL. SC. 1, 3 TO 6"}]
[{"$f":"'teacher-wise time-table'!$L$3","v":"11:20-11:55"},{"$f":"'teacher-wise time-table'!$L$4","v":"11:25-11:55"},{"$f":"'teacher-wise time-table'!$L$2","v":7},{"$f":"VLOOKUP(E121,'teacher-wise time-table'!$A$5:$N$106,12)","v":"12th B"},{"$f":"VLOOKUP(E121+1,'teacher-wise time-table'!$A$5:$N$106,12)","v":"POL. SC. 2-6"}]
[{"$f":"'teacher-wise time-table'!$M$3","v":"11:55-12:25"},{"$f":"'teacher-wise time-table'!$M$4","v":"11:55-12:25"},{"$f":"'teacher-wise time-table'!$M$2","v":8},{"$f":"VLOOKUP(E121,'teacher-wise time-table'!$A$5:$N$106,13)","v":"11th A"},{"$f":"VLOOKUP(E121+1,'teacher-wise time-table'!$A$5:$N$106,13)","v":"POL. SC. 1 TO 4"}]
["SIGN. OF THE PRINCIPAL",null,null,{"$f":"'teacher-wise time-table'!$N$2","v":"TTL PERIODS PER WEEK"},{"$f":"VLOOKUP(E121,'teacher-wise time-table'!$A$5:$N$106,14)","v":"28+4"}]
[{"$f":"'teacher-wise time-table'!$B$1","v":"GOVT. GIRLS' HR. SEC. SCHOOL, NIMBAHERA,                                                  TEACHER-WISE TIME TABLE FOR THE YEAR 2014-15"},null,null,null,{"$f":"E121+3","v":28}]
[]
[{"$f":"'teacher-wise time-table'!$D$3","v":"SUMMER TIMINGS"},{"$f":"'teacher-wise time-table'!$D$4","v":"WINTER TIMINGS"},{"$f":"'teacher-wise time-table'!$D$2","v":"PERIOD"},{"$f":"VLOOKUP(E136,'teacher-wise time-table'!$A$5:$N$106,2)","v":"MR. I"},{"$f":"VLOOKUP(E136,'teacher-wise time-table'!$A$5:$N$106,3)","v":"GUEST LECTURER, POL. SCIENCE"}]
[]
[{"$f":"'teacher-wise time-table'!$B$3","v":"7:00-7:20"},{"$f":"'teacher-wise time-table'!$B$4","v":"7:30-7:50"},{"$f":"'teacher-wise time-table'!$B$2","v":"PRAYER"},{"$f":"VLOOKUP(E136,'teacher-wise time-table'!$A$5:$N$106,4)","v":"CLASS TEACHER 11 C"}]
[{"$f":"'teacher-wise time-table'!$E$3","v":"07:20-07:55"},{"$f":"'teacher-wise time-table'!$E$4","v":"07:50-08:25"},{"$f":"'teacher-wise time-table'!$E$2","v":1},{"$f":"VLOOKUP(E136,'teacher-wise time-table'!$A$5:$N$106,5)","v":0},{"$f":"VLOOKUP(E136+1,'teacher-wise time-table'!$A$5:$N$106,5)","v":0}]
[{"$f":"'teacher-wise time-table'!$F$3","v":"07:55-08:30"},{"$f":"'teacher-wise time-table'!$F$4","v":"08:25-08:55"},{"$f":"'teacher-wise time-table'!$F$2","v":2},{"$f":"VLOOKUP(E136,'teacher-wise time-table'!$A$5:$N$106,6)","v":"11th C+B "},{"$f":"VLOOKUP(E136+1,'teacher-wise time-table'!$A$5:$N$106,6)","v":"HOME SC. 1 TO 6"}]
[{"$f":"'teacher-wise time-table'!$G$3","v":"08:30-09:05"},{"$f":"'teacher-wise time-table'!$G$4","v":"08:55-09:25"},{"$f":"'teacher-wise time-table'!$G$2","v":3},{"$f":"VLOOKUP(E136,'teacher-wise time-table'!$A$5:$N$106,7)","v":"11th E+A"},{"$f":"VLOOKUP(E136+1,'teacher-wise time-table'!$A$5:$N$106,7)","v":"HOME SC. 1 TO 6"}]
[{"$f":"'teacher-wise time-table'!$H$3","v":"09:05-09:40"},{"$f":"'teacher-wise time-table'!$H$4","v":"09:25-09:55"},{"$f":"'teacher-wise time-table'!$H$2","v":4},{"$f":"VLOOKUP(E136,'teacher-wise time-table'!$A$5:$N$106,8)","v":0},{"$f":"VLOOKUP(E136+1,'teacher-wise time-table'!$A$5:$N$106,8)","v":0}]
[{"$f":"'teacher-wise time-table'!$I$6","v":"09:40-10:10         "},{"$f":"'teacher-wise time-table'!$I$11","v":"09:55-10:25"},{"$f":"'teacher-wise time-table'!$I$2","v":" BREAK      "}]
[{"$f":"'teacher-wise time-table'!$J$3","v":"10:10-10:45"},{"$f":"'teacher-wise time-table'!$J$4","v":"10:25-10:55"},{"$f":"'teacher-wise time-table'!$J$2","v":5},{"$f":"VLOOKUP(E136,'teacher-wise time-table'!$A$5:$N$106,10)","v":"11th E+A"},{"$f":"VLOOKUP(E136+1,'teacher-wise time-table'!$A$5:$N$106,10)","v":"HOME SC. 1 TO 4"}]
[{"$f":"'teacher-wise time-table'!$K$3","v":"10:45-11:20"},{"$f":"'teacher-wise time-table'!$K$4","v":"10:55-11:25"},{"$f":"'teacher-wise time-table'!$K$2","v":6},{"$f":"VLOOKUP(E136,'teacher-wise time-table'!$A$5:$N$106,11)","v":"11th B"},{"$f":"VLOOKUP(E136+1,'teacher-wise time-table'!$A$5:$N$106,11)","v":"POL. SC. 1 TO 6"}]
[{"$f":"'teacher-wise time-table'!$L$3","v":"11:20-11:55"},{"$f":"'teacher-wise time-table'!$L$4","v":"11:25-11:55"},{"$f":"'teacher-wise time-table'!$L$2","v":7},{"$f":"VLOOKUP(E136,'teacher-wise time-table'!$A$5:$N$106,12)","v":"11th C+B "},{"$f":"VLOOKUP(E136+1,'teacher-wise time-table'!$A$5:$N$106,12)","v":"HOME SC. 3 TO 6"}]
[{"$f":"'teacher-wise time-table'!$M$3","v":"11:55-12:25"},{"$f":"'teacher-wise time-table'!$M$4","v":"11:55-12:25"},{"$f":"'teacher-wise time-table'!$M$2","v":8},{"$f":"VLOOKUP(E136,'teacher-wise time-table'!$A$5:$N$106,13)","v":"11th B "},{"$f":"VLOOKUP(E136+1,'teacher-wise time-table'!$A$5:$N$106,13)","v":"POL. SC. 1 TO 4"}]
["SIGN. OF THE PRINCIPAL",null,null,{"$f":"'teacher-wise time-table'!$N$2","v":"TTL PERIODS PER WEEK"},{"$f":"VLOOKUP(E136,'teacher-wise time-table'!$A$5:$N$106,14)","v":"30+4"}]
[{"$f":"'teacher-wise time-table'!$B$1","v":"GOVT. GIRLS' HR. SEC. SCHOOL, NIMBAHERA,                                                  TEACHER-WISE TIME TABLE FOR THE YEAR 2014-15"},null,null,null,{"$f":"E136+3","v":31}]
[]
[{"$f":"'teacher-wise time-table'!$D$3","v":"SUMMER TIMINGS"},{"$f":"'teacher-wise time-table'!$D$4","v":"WINTER TIMINGS"},{"$f":"'teacher-wise time-table'!$D$2","v":"PERIOD"},{"$f":"VLOOKUP(E151,'teacher-wise time-table'!$A$5:$N$106,2)","v":"MR. J"},{"$f":"VLOOKUP(E151,'teacher-wise time-table'!$A$5:$N$106,3)","v":"LECTURER, H. SCIENCE "}]
[]
[{"$f":"'teacher-wise time-table'!$B$3","v":"7:00-7:20"},{"$f":"'teacher-wise time-table'!$B$4","v":"7:30-7:50"},{"$f":"'teacher-wise time-table'!$B$2","v":"PRAYER"},{"$f":"VLOOKUP(E151,'teacher-wise time-table'!$A$5:$N$106,4)","v":"CLASS TEACHER            12 C"}]
[{"$f":"'teacher-wise time-table'!$E$3","v":"07:20-07:55"},{"$f":"'teacher-wise time-table'!$E$4","v":"07:50-08:25"},{"$f":"'teacher-wise time-table'!$E$2","v":1},{"$f":"VLOOKUP(E151,'teacher-wise time-table'!$A$5:$N$106,5)","v":0},{"$f":"VLOOKUP(E151+1,'teacher-wise time-table'!$A$5:$N$106,5)","v":0}]
[{"$f":"'teacher-wise time-table'!$F$3","v":"07:55-08:30"},{"$f":"'teacher-wise time-table'!$F$4","v":"08:25-08:55"},{"$f":"'teacher-wise time-table'!$F$2","v":2},{"$f":"VLOOKUP(E151,'teacher-wise time-table'!$A$5:$N$106,6)","v":0},{"$f":"VLOOKUP(E151+1,'teacher-wise time-table'!$A$5:$N$106,6)","v":0}]
[{"$f":"'teacher-wise time-table'!$G$3","v":"08:30-09:05"},{"$f":"'teacher-wise time-table'!$G$4","v":"08:55-09:25"},{"$f":"'teacher-wise time-table'!$G$2","v":3},{"$f":"VLOOKUP(E151,'teacher-wise time-table'!$A$5:$N$106,7)","v":"12th C+B"},{"$f":"VLOOKUP(E151+1,'teacher-wise time-table'!$A$5:$N$106,7)","v":"HOME. SC. 1-6"}]
[{"$f":"'teacher-wise time-table'!$H$3","v":"09:05-09:40"},{"$f":"'teacher-wise time-table'!$H$4","v":"09:25-09:55"},{"$f":"'teacher-wise time-table'!$H$2","v":4},{"$f":"VLOOKUP(E151,'teacher-wise time-table'!$A$5:$N$106,8)","v":"12th E"},{"$f":"VLOOKUP(E151+1,'teacher-wise time-table'!$A$5:$N$106,8)","v":"HOME SC. 1 TO 6"}]
[{"$f":"'teacher-wise time-table'!$I$6","v":"09:40-10:10         "},{"$f":"'teacher-wise time-table'!$I$11","v":"09:55-10:25"},{"$f":"'teacher-wise time-table'!$I$2","v":" BREAK      "}]
[{"$f":"'teacher-wise time-table'!$J$3","v":"10:10-10:45"},{"$f":"'teacher-wise time-table'!$J$4","v":"10:25-10:55"},{"$f":"'teacher-wise time-table'!$J$2","v":5},{"$f":"VLOOKUP(E151,'teacher-wise time-table'!$A$5:$N$106,10)","v":"12th A"},{"$f":"VLOOKUP(E151+1,'teacher-wise time-table'!$A$5:$N$106,10)","v":"HOME SC. 1 TO 6"}]
[{"$f":"'teacher-wise time-table'!$K$3","v":"10:45-11:20"},{"$f":"'teacher-wise time-table'!$K$4","v":"10:55-11:25"},{"$f":"'teacher-wise time-table'!$K$2","v":6},{"$f":"VLOOKUP(E151,'teacher-wise time-table'!$A$5:$N$106,11)","v":"12th B"},{"$f":"VLOOKUP(E151+1,'teacher-wise time-table'!$A$5:$N$106,11)","v":"HOME. SC. 1 TO 5"}]
[{"$f":"'teacher-wise time-table'!$L$3","v":"11:20-11:55"},{"$f":"'teacher-wise time-table'!$L$4","v":"11:25-11:55"},{"$f":"'teacher-wise time-table'!$L$2","v":7},{"$f":"VLOOKUP(E151,'teacher-wise time-table'!$A$5:$N$106,12)","v":"12th E+A "},{"$f":"VLOOKUP(E151+1,'teacher-wise time-table'!$A$5:$N$106,12)","v":"HOME  SC.1,2,4-6 "}]
[{"$f":"'teacher-wise time-table'!$M$3","v":"11:55-12:25"},{"$f":"'teacher-wise time-table'!$M$4","v":"11:55-12:25"},{"$f":"'teacher-wise time-table'!$M$2","v":8},{"$f":"VLOOKUP(E151,'teacher-wise time-table'!$A$5:$N$106,13)","v":"12th C"},{"$f":"VLOOKUP(E151+1,'teacher-wise time-table'!$A$5:$N$106,13)","v":"HOME. SC. 1,3-6"}]
["SIGN. OF THE PRINCIPAL",null,null,{"$f":"'teacher-wise time-table'!$N$2","v":"TTL PERIODS PER WEEK"},{"$f":"VLOOKUP(E151,'teacher-wise time-table'!$A$5:$N$106,14)","v":"28+5"}]
[{"$f":"'teacher-wise time-table'!$B$1","v":"GOVT. GIRLS' HR. SEC. SCHOOL, NIMBAHERA,                                                  TEACHER-WISE TIME TABLE FOR THE YEAR 2014-15"},null,null,null,{"$f":"E151+3","v":34}]
[]
[{"$f":"'teacher-wise time-table'!$D$3","v":"SUMMER TIMINGS"},{"$f":"'teacher-wise time-table'!$D$4","v":"WINTER TIMINGS"},{"$f":"'teacher-wise time-table'!$D$2","v":"PERIOD"},{"$f":"VLOOKUP(E166,'teacher-wise time-table'!$A$5:$N$106,2)","v":"MR. K"},{"$f":"VLOOKUP(E166,'teacher-wise time-table'!$A$5:$N$106,3)","v":"SN. TEACHER, URDU "}]
[]
[{"$f":"'teacher-wise time-table'!$B$3","v":"7:00-7:20"},{"$f":"'teacher-wise time-table'!$B$4","v":"7:30-7:50"},{"$f":"'teacher-wise time-table'!$B$2","v":"PRAYER"},{"$f":"VLOOKUP(E166,'teacher-wise time-table'!$A$5:$N$106,4)","v":"IN-CHARGE BOARD EXAM."}]
[{"$f":"'teacher-wise time-table'!$E$3","v":"07:20-07:55"},{"$f":"'teacher-wise time-table'!$E$4","v":"07:50-08:25"},{"$f":"'teacher-wise time-table'!$E$2","v":1},{"$f":"VLOOKUP(E166,'teacher-wise time-table'!$A$5:$N$106,5)","v":0},{"$f":"VLOOKUP(E166+1,'teacher-wise time-table'!$A$5:$N$106,5)","v":0}]
[{"$f":"'teacher-wise time-table'!$F$3","v":"07:55-08:30"},{"$f":"'teacher-wise time-table'!$F$4","v":"08:25-08:55"},{"$f":"'teacher-wise time-table'!$F$2","v":2},{"$f":"VLOOKUP(E166,'teacher-wise time-table'!$A$5:$N$106,6)","v":0},{"$f":"VLOOKUP(E166+1,'teacher-wise time-table'!$A$5:$N$106,6)","v":0}]
[{"$f":"'teacher-wise time-table'!$G$3","v":"08:30-09:05"},{"$f":"'teacher-wise time-table'!$G$4","v":"08:55-09:25"},{"$f":"'teacher-wise time-table'!$G$2","v":3},{"$f":"VLOOKUP(E166,'teacher-wise time-table'!$A$5:$N$106,7)","v":0},{"$f":"VLOOKUP(E166+1,'teacher-wise time-table'!$A$5:$N$106,7)","v":0}]
[{"$f":"'teacher-wise time-table'!$H$3","v":"09:05-09:40"},{"$f":"'teacher-wise time-table'!$H$4","v":"09:25-09:55"},{"$f":"'teacher-wise time-table'!$H$2","v":4},{"$f":"VLOOKUP(E166,'teacher-wise time-table'!$A$5:$N$106,8)","v":0},{"$f":"VLOOKUP(E166+1,'teacher-wise time-table'!$A$5:$N$106,8)","v":0}]
[{"$f":"'teacher-wise time-table'!$I$6","v":"09:40-10:10         "},{"$f":"'teacher-wise time-table'!$I$11","v":"09:55-10:25"},{"$f":"'teacher-wise time-table'!$I$2","v":" BREAK      "}]
[{"$f":"'teacher-wise time-table'!$J$3","v":"10:10-10:45"},{"$f":"'teacher-wise time-table'!$J$4","v":"10:25-10:55"},{"$f":"'teacher-wise time-table'!$J$2","v":5},{"$f":"VLOOKUP(E166,'teacher-wise time-table'!$A$5:$N$106,10)","v":"12th C "},{"$f":"VLOOKUP(E166+1,'teacher-wise time-table'!$A$5:$N$106,10)","v":"URDU 1 TO 6"}]
[{"$f":"'teacher-wise time-table'!$K$3","v":"10:45-11:20"},{"$f":"'teacher-wise time-table'!$K$4","v":"10:55-11:25"},{"$f":"'teacher-wise time-table'!$K$2","v":6},{"$f":"VLOOKUP(E166,'teacher-wise time-table'!$A$5:$N$106,11)","v":"11th C "},{"$f":"VLOOKUP(E166+1,'teacher-wise time-table'!$A$5:$N$106,11)","v":"URDU 1 TO 6"}]
[{"$f":"'teacher-wise time-table'!$L$3","v":"11:20-11:55"},{"$f":"'teacher-wise time-table'!$L$4","v":"11:25-11:55"},{"$f":"'teacher-wise time-table'!$L$2","v":7},{"$f":"VLOOKUP(E166,'teacher-wise time-table'!$A$5:$N$106,12)","v":"12th C "},{"$f":"VLOOKUP(E166+1,'teacher-wise time-table'!$A$5:$N$106,12)","v":"URDU 2-6"}]
[{"$f":"'teacher-wise time-table'!$M$3","v":"11:55-12:25"},{"$f":"'teacher-wise time-table'!$M$4","v":"11:55-12:25"},{"$f":"'teacher-wise time-table'!$M$2","v":8},{"$f":"VLOOKUP(E166,'teacher-wise time-table'!$A$5:$N$106,13)","v":"11th C "},{"$f":"VLOOKUP(E166+1,'teacher-wise time-table'!$A$5:$N$106,13)","v":"URDU 1 TO 4"}]
["SIGN. OF THE PRINCIPAL",null,null,{"$f":"'teacher-wise time-table'!$N$2","v":"TTL PERIODS PER WEEK"},{"$f":"VLOOKUP(E166,'teacher-wise time-table'!$A$5:$N$106,14)","v":21}]
[{"$f":"'teacher-wise time-table'!$B$1","v":"GOVT. GIRLS' HR. SEC. SCHOOL, NIMBAHERA,                                                  TEACHER-WISE TIME TABLE FOR THE YEAR 2014-15"},null,null,null,{"$f":"E166+3","v":37}]
[]
[{"$f":"'teacher-wise time-table'!$D$3","v":"SUMMER TIMINGS"},{"$f":"'teacher-wise time-table'!$D$4","v":"WINTER TIMINGS"},{"$f":"'teacher-wise time-table'!$D$2","v":"PERIOD"},{"$f":"VLOOKUP(E181,'teacher-wise time-table'!$A$5:$N$106,2)","v":"VACANT POST 2"},{"$f":"VLOOKUP(E181,'teacher-wise time-table'!$A$5:$N$106,3)","v":"LECTURER, GEOGRAPHY"}]
[]
[{"$f":"'teacher-wise time-table'!$B$3","v":"7:00-7:20"},{"$f":"'teacher-wise time-table'!$B$4","v":"7:30-7:50"},{"$f":"'teacher-wise time-table'!$B$2","v":"PRAYER"},{"$f":"VLOOKUP(E181,'teacher-wise time-table'!$A$5:$N$106,4)","v":0}]
[{"$f":"'teacher-wise time-table'!$E$3","v":"07:20-07:55"},{"$f":"'teacher-wise time-table'!$E$4","v":"07:50-08:25"},{"$f":"'teacher-wise time-table'!$E$2","v":1},{"$f":"VLOOKUP(E181,'teacher-wise time-table'!$A$5:$N$106,5)","v":"11th E"},{"$f":"VLOOKUP(E181+1,'teacher-wise time-table'!$A$5:$N$106,5)","v":"GEOGRAPHY 1-6"}]
[{"$f":"'teacher-wise time-table'!$F$3","v":"07:55-08:30"},{"$f":"'teacher-wise time-table'!$F$4","v":"08:25-08:55"},{"$f":"'teacher-wise time-table'!$F$2","v":2},{"$f":"VLOOKUP(E181,'teacher-wise time-table'!$A$5:$N$106,6)","v":"12th E"},{"$f":"VLOOKUP(E181+1,'teacher-wise time-table'!$A$5:$N$106,6)","v":"GEOGRAPHY 1 to 6"}]
[{"$f":"'teacher-wise time-table'!$G$3","v":"08:30-09:05"},{"$f":"'teacher-wise time-table'!$G$4","v":"08:55-09:25"},{"$f":"'teacher-wise time-table'!$G$2","v":3},{"$f":"VLOOKUP(E181,'teacher-wise time-table'!$A$5:$N$106,7)","v":0},{"$f":"VLOOKUP(E181+1,'teacher-wise time-table'!$A$5:$N$106,7)","v":0}]
[{"$f":"'teacher-wise time-table'!$H$3","v":"09:05-09:40"},{"$f":"'teacher-wise time-table'!$H$4","v":"09:25-09:55"},{"$f":"'teacher-wise time-table'!$H$2","v":4},{"$f":"VLOOKUP(E181,'teacher-wise time-table'!$A$5:$N$106,8)","v":0},{"$f":"VLOOKUP(E181+1,'teacher-wise time-table'!$A$5:$N$106,8)","v":0}]
[{"$f":"'teacher-wise time-table'!$I$6","v":"09:40-10:10         "},{"$f":"'teacher-wise time-table'!$I$11","v":"09:55-10:25"},{"$f":"'teacher-wise time-table'!$I$2","v":" BREAK      "}]
[{"$f":"'teacher-wise time-table'!$J$3","v":"10:10-10:45"},{"$f":"'teacher-wise time-table'!$J$4","v":"10:25-10:55"},{"$f":"'teacher-wise time-table'!$J$2","v":5},{"$f":"VLOOKUP(E181,'teacher-wise time-table'!$A$5:$N$106,10)","v":0},{"$f":"VLOOKUP(E181+1,'teacher-wise time-table'!$A$5:$N$106,10)","v":0}]
[{"$f":"'teacher-wise time-table'!$K$3","v":"10:45-11:20"},{"$f":"'teacher-wise time-table'!$K$4","v":"10:55-11:25"},{"$f":"'teacher-wise time-table'!$K$2","v":6},{"$f":"VLOOKUP(E181,'teacher-wise time-table'!$A$5:$N$106,11)","v":"12th E "},{"$f":"VLOOKUP(E181+1,'teacher-wise time-table'!$A$5:$N$106,11)","v":"GEOGRAPHY 1, 3 TO 6"}]
[{"$f":"'teacher-wise time-table'!$L$3","v":"11:20-11:55"},{"$f":"'teacher-wise time-table'!$L$4","v":"11:25-11:55"},{"$f":"'teacher-wise time-table'!$L$2","v":7},{"$f":"VLOOKUP(E181,'teacher-wise time-table'!$A$5:$N$106,12)","v":0},{"$f":"VLOOKUP(E181+1,'teacher-wise time-table'!$A$5:$N$106,12)","v":0}]
[{"$f":"'teacher-wise time-table'!$M$3","v":"11:55-12:25"},{"$f":"'teacher-wise time-table'!$M$4","v":"11:55-12:25"},{"$f":"'teacher-wise time-table'!$M$2","v":8},{"$f":"VLOOKUP(E181,'teacher-wise time-table'!$A$5:$N$106,13)","v":"11th E "},{"$f":"VLOOKUP(E181+1,'teacher-wise time-table'!$A$5:$N$106,13)","v":"GEOGRAPHY 1 TO 4"}]
["SIGN. OF THE PRINCIPAL",null,null,{"$f":"'teacher-wise time-table'!$N$2","v":"TTL PERIODS PER WEEK"},{"$f":"VLOOKUP(E181,'teacher-wise time-table'!$A$5:$N$106,14)","v":21}]
[{"$f":"'teacher-wise time-table'!$B$1","v":"GOVT. GIRLS' HR. SEC. SCHOOL, NIMBAHERA,                                                  TEACHER-WISE TIME TABLE FOR THE YEAR 2014-15"},null,null,null,{"$f":"E181+3","v":40}]
[]
[{"$f":"'teacher-wise time-table'!$D$3","v":"SUMMER TIMINGS"},{"$f":"'teacher-wise time-table'!$D$4","v":"WINTER TIMINGS"},{"$f":"'teacher-wise time-table'!$D$2","v":"PERIOD"},{"$f":"VLOOKUP(E196,'teacher-wise time-table'!$A$5:$N$106,2)","v":"MR. K"},{"$f":"VLOOKUP(E196,'teacher-wise time-table'!$A$5:$N$106,3)","v":"PTI, GRADE II"}]
[]
[{"$f":"'teacher-wise time-table'!$B$3","v":"7:00-7:20"},{"$f":"'teacher-wise time-table'!$B$4","v":"7:30-7:50"},{"$f":"'teacher-wise time-table'!$B$2","v":"PRAYER"},{"$f":"VLOOKUP(E196,'teacher-wise time-table'!$A$5:$N$106,4)","v":"DISCIPLINE"}]
[{"$f":"'teacher-wise time-table'!$E$3","v":"07:20-07:55"},{"$f":"'teacher-wise time-table'!$E$4","v":"07:50-08:25"},{"$f":"'teacher-wise time-table'!$E$2","v":1},{"$f":"VLOOKUP(E196,'teacher-wise time-table'!$A$5:$N$106,5)","v":0},{"$f":"VLOOKUP(E196+1,'teacher-wise time-table'!$A$5:$N$106,5)","v":0}]
[{"$f":"'teacher-wise time-table'!$F$3","v":"07:55-08:30"},{"$f":"'teacher-wise time-table'!$F$4","v":"08:25-08:55"},{"$f":"'teacher-wise time-table'!$F$2","v":2},{"$f":"VLOOKUP(E196,'teacher-wise time-table'!$A$5:$N$106,6)","v":0},{"$f":"VLOOKUP(E196+1,'teacher-wise time-table'!$A$5:$N$106,6)","v":0}]
[{"$f":"'teacher-wise time-table'!$G$3","v":"08:30-09:05"},{"$f":"'teacher-wise time-table'!$G$4","v":"08:55-09:25"},{"$f":"'teacher-wise time-table'!$G$2","v":3},{"$f":"VLOOKUP(E196,'teacher-wise time-table'!$A$5:$N$106,7)","v":0},{"$f":"VLOOKUP(E196+1,'teacher-wise time-table'!$A$5:$N$106,7)","v":0}]
[{"$f":"'teacher-wise time-table'!$H$3","v":"09:05-09:40"},{"$f":"'teacher-wise time-table'!$H$4","v":"09:25-09:55"},{"$f":"'teacher-wise time-table'!$H$2","v":4},{"$f":"VLOOKUP(E196,'teacher-wise time-table'!$A$5:$N$106,8)","v":0},{"$f":"VLOOKUP(E196+1,'teacher-wise time-table'!$A$5:$N$106,8)","v":0}]
[{"$f":"'teacher-wise time-table'!$I$6","v":"09:40-10:10         "},{"$f":"'teacher-wise time-table'!$I$11","v":"09:55-10:25"},{"$f":"'teacher-wise time-table'!$I$2","v":" BREAK      "}]
[{"$f":"'teacher-wise time-table'!$J$3","v":"10:10-10:45"},{"$f":"'teacher-wise time-table'!$J$4","v":"10:25-10:55"},{"$f":"'teacher-wise time-table'!$J$2","v":5},{"$f":"VLOOKUP(E196,'teacher-wise time-table'!$A$5:$N$106,10)","v":"11 B ,C RAJ ST 3, JK 4,  11 E+A RAJ ST 5,6 SG"},{"$f":"VLOOKUP(E196+1,'teacher-wise time-table'!$A$5:$N$106,10)","v":0}]
[{"$f":"'teacher-wise time-table'!$K$3","v":"10:45-11:20"},{"$f":"'teacher-wise time-table'!$K$4","v":"10:55-11:25"},{"$f":"'teacher-wise time-table'!$K$2","v":6},{"$f":"VLOOKUP(E196,'teacher-wise time-table'!$A$5:$N$106,11)","v":"11 E+A JK  1,2 SG"},{"$f":"VLOOKUP(E196+1,'teacher-wise time-table'!$A$5:$N$106,11)","v":0}]
[{"$f":"'teacher-wise time-table'!$L$3","v":"11:20-11:55"},{"$f":"'teacher-wise time-table'!$L$4","v":"11:25-11:55"},{"$f":"'teacher-wise time-table'!$L$2","v":7},{"$f":"VLOOKUP(E196,'teacher-wise time-table'!$A$5:$N$106,12)","v":"11 C+B  RAJ STD 1,2"},{"$f":"VLOOKUP(E196+1,'teacher-wise time-table'!$A$5:$N$106,12)","v":0}]
[{"$f":"'teacher-wise time-table'!$M$3","v":"11:55-12:25"},{"$f":"'teacher-wise time-table'!$M$4","v":"11:55-12:25"},{"$f":"'teacher-wise time-table'!$M$2","v":8},{"$f":"VLOOKUP(E196,'teacher-wise time-table'!$A$5:$N$106,13)","v":"11 C+B  RAJ STD 5,6,          11 E+A JK  5 RAJ ST 6 SG"},{"$f":"VLOOKUP(E196+1,'teacher-wise time-table'!$A$5:$N$106,13)","v":0}]
["SIGN. OF THE PRINCIPAL",null,null,{"$f":"'teacher-wise time-table'!$N$2","v":"TTL PERIODS PER WEEK"},{"$f":"VLOOKUP(E196,'teacher-wise time-table'!$A$5:$N$106,14)","v":12}]
[{"$f":"'teacher-wise time-table'!$B$1","v":"GOVT. GIRLS' HR. SEC. SCHOOL, NIMBAHERA,                                                  TEACHER-WISE TIME TABLE FOR THE YEAR 2014-15"},null,null,null,{"$f":"E196+3","v":43}]
[]
[{"$f":"'teacher-wise time-table'!$D$3","v":"SUMMER TIMINGS"},{"$f":"'teacher-wise time-table'!$D$4","v":"WINTER TIMINGS"},{"$f":"'teacher-wise time-table'!$D$2","v":"PERIOD"},{"$f":"VLOOKUP(E211,'teacher-wise time-table'!$A$5:$N$106,2)","v":"MR. L"},{"$f":"VLOOKUP(E211,'teacher-wise time-table'!$A$5:$N$106,3)","v":"LAB. ASSTT., BIOLOGY"}]
[]
[{"$f":"'teacher-wise time-table'!$B$3","v":"7:00-7:20"},{"$f":"'teacher-wise time-table'!$B$4","v":"7:30-7:50"},{"$f":"'teacher-wise time-table'!$B$2","v":"PRAYER"},{"$f":"VLOOKUP(E211,'teacher-wise time-table'!$A$5:$N$106,4)","v":"ASSTT.                       IN-CHARGE         LOCAL EXAM."}]
[{"$f":"'teacher-wise time-table'!$E$3","v":"07:20-07:55"},{"$f":"'teacher-wise time-table'!$E$4","v":"07:50-08:25"},{"$f":"'teacher-wise time-table'!$E$2","v":1},{"$f":"VLOOKUP(E211,'teacher-wise time-table'!$A$5:$N$106,5)","v":0},{"$f":"VLOOKUP(E211+1,'teacher-wise time-table'!$A$5:$N$106,5)","v":0}]
[{"$f":"'teacher-wise time-table'!$F$3","v":"07:55-08:30"},{"$f":"'teacher-wise time-table'!$F$4","v":"08:25-08:55"},{"$f":"'teacher-wise time-table'!$F$2","v":2},{"$f":"VLOOKUP(E211,'teacher-wise time-table'!$A$5:$N$106,6)","v":0},{"$f":"VLOOKUP(E211+1,'teacher-wise time-table'!$A$5:$N$106,6)","v":0}]
[{"$f":"'teacher-wise time-table'!$G$3","v":"08:30-09:05"},{"$f":"'teacher-wise time-table'!$G$4","v":"08:55-09:25"},{"$f":"'teacher-wise time-table'!$G$2","v":3},{"$f":"VLOOKUP(E211,'teacher-wise time-table'!$A$5:$N$106,7)","v":0},{"$f":"VLOOKUP(E211+1,'teacher-wise time-table'!$A$5:$N$106,7)","v":0}]
[{"$f":"'teacher-wise time-table'!$H$3","v":"09:05-09:40"},{"$f":"'teacher-wise time-table'!$H$4","v":"09:25-09:55"},{"$f":"'teacher-wise time-table'!$H$2","v":4},{"$f":"VLOOKUP(E211,'teacher-wise time-table'!$A$5:$N$106,8)","v":0},{"$f":"VLOOKUP(E211+1,'teacher-wise time-table'!$A$5:$N$106,8)","v":0}]
[{"$f":"'teacher-wise time-table'!$I$6","v":"09:40-10:10         "},{"$f":"'teacher-wise time-table'!$I$11","v":"09:55-10:25"},{"$f":"'teacher-wise time-table'!$I$2","v":" BREAK      "}]
[{"$f":"'teacher-wise time-table'!$J$3","v":"10:10-10:45"},{"$f":"'teacher-wise time-table'!$J$4","v":"10:25-10:55"},{"$f":"'teacher-wise time-table'!$J$2","v":5},{"$f":"VLOOKUP(E211,'teacher-wise time-table'!$A$5:$N$106,10)","v":"12th D BIO. PR."},{"$f":"VLOOKUP(E211+1,'teacher-wise time-table'!$A$5:$N$106,10)","v":" D1 1,2  D2 3,4"}]
[{"$f":"'teacher-wise time-table'!$K$3","v":"10:45-11:20"},{"$f":"'teacher-wise time-table'!$K$4","v":"10:55-11:25"},{"$f":"'teacher-wise time-table'!$K$2","v":6},{"$f":"VLOOKUP(E211,'teacher-wise time-table'!$A$5:$N$106,11)","v":"12th D BIO. PR."},{"$f":"VLOOKUP(E211+1,'teacher-wise time-table'!$A$5:$N$106,11)","v":" D1 1,2  D2 3,4,12th C+B RAJ ST 6"}]
[{"$f":"'teacher-wise time-table'!$L$3","v":"11:20-11:55"},{"$f":"'teacher-wise time-table'!$L$4","v":"11:25-11:55"},{"$f":"'teacher-wise time-table'!$L$2","v":7},{"$f":"VLOOKUP(E211,'teacher-wise time-table'!$A$5:$N$106,12)","v":"11th D BIO. PR."},{"$f":"VLOOKUP(E211+1,'teacher-wise time-table'!$A$5:$N$106,12)","v":" D1 3,4  D2 5,6, 12th C+B RAJ ST 1"}]
[{"$f":"'teacher-wise time-table'!$M$3","v":"11:55-12:25"},{"$f":"'teacher-wise time-table'!$M$4","v":"11:55-12:25"},{"$f":"'teacher-wise time-table'!$M$2","v":8},{"$f":"VLOOKUP(E211,'teacher-wise time-table'!$A$5:$N$106,13)","v":"11th D BIO. PR."},{"$f":"VLOOKUP(E211+1,'teacher-wise time-table'!$A$5:$N$106,13)","v":" D1 3,4  D2 5,6, 12th C+B RAJ ST 2"}]
["SIGN. OF THE PRINCIPAL",null,null,{"$f":"'teacher-wise time-table'!$N$2","v":"TTL PERIODS PER WEEK"},{"$f":"VLOOKUP(E211,'teacher-wise time-table'!$A$5:$N$106,14)","v":19}]
[{"$f":"'teacher-wise time-table'!$B$1","v":"GOVT. GIRLS' HR. SEC. SCHOOL, NIMBAHERA,                                                  TEACHER-WISE TIME TABLE FOR THE YEAR 2014-15"},null,null,null,{"$f":"E211+3","v":46}]
[]
[{"$f":"'teacher-wise time-table'!$D$3","v":"SUMMER TIMINGS"},{"$f":"'teacher-wise time-table'!$D$4","v":"WINTER TIMINGS"},{"$f":"'teacher-wise time-table'!$D$2","v":"PERIOD"},{"$f":"VLOOKUP(E226,'teacher-wise time-table'!$A$5:$N$106,2)","v":"MR. M"},{"$f":"VLOOKUP(E226,'teacher-wise time-table'!$A$5:$N$106,3)","v":"LAB. ASSTT., CHEMISTRY"}]
[]
[{"$f":"'teacher-wise time-table'!$B$3","v":"7:00-7:20"},{"$f":"'teacher-wise time-table'!$B$4","v":"7:30-7:50"},{"$f":"'teacher-wise time-table'!$B$2","v":"PRAYER"},{"$f":"VLOOKUP(E226,'teacher-wise time-table'!$A$5:$N$106,4)","v":"CLASS TEACHER       11 D + ASSTT.      IN-CHARGE  BOARD EXAM."}]
[{"$f":"'teacher-wise time-table'!$E$3","v":"07:20-07:55"},{"$f":"'teacher-wise time-table'!$E$4","v":"07:50-08:25"},{"$f":"'teacher-wise time-table'!$E$2","v":1},{"$f":"VLOOKUP(E226,'teacher-wise time-table'!$A$5:$N$106,5)","v":0},{"$f":"VLOOKUP(E226+1,'teacher-wise time-table'!$A$5:$N$106,5)","v":0}]
[{"$f":"'teacher-wise time-table'!$F$3","v":"07:55-08:30"},{"$f":"'teacher-wise time-table'!$F$4","v":"08:25-08:55"},{"$f":"'teacher-wise time-table'!$F$2","v":2},{"$f":"VLOOKUP(E226,'teacher-wise time-table'!$A$5:$N$106,6)","v":0},{"$f":"VLOOKUP(E226+1,'teacher-wise time-table'!$A$5:$N$106,6)","v":0}]
[{"$f":"'teacher-wise time-table'!$G$3","v":"08:30-09:05"},{"$f":"'teacher-wise time-table'!$G$4","v":"08:55-09:25"},{"$f":"'teacher-wise time-table'!$G$2","v":3},{"$f":"VLOOKUP(E226,'teacher-wise time-table'!$A$5:$N$106,7)","v":0},{"$f":"VLOOKUP(E226+1,'teacher-wise time-table'!$A$5:$N$106,7)","v":0}]
[{"$f":"'teacher-wise time-table'!$H$3","v":"09:05-09:40"},{"$f":"'teacher-wise time-table'!$H$4","v":"09:25-09:55"},{"$f":"'teacher-wise time-table'!$H$2","v":4},{"$f":"VLOOKUP(E226,'teacher-wise time-table'!$A$5:$N$106,8)","v":0},{"$f":"VLOOKUP(E226+1,'teacher-wise time-table'!$A$5:$N$106,8)","v":0}]
[{"$f":"'teacher-wise time-table'!$I$6","v":"09:40-10:10         "},{"$f":"'teacher-wise time-table'!$I$11","v":"09:55-10:25"},{"$f":"'teacher-wise time-table'!$I$2","v":" BREAK      "}]
[{"$f":"'teacher-wise time-table'!$J$3","v":"10:10-10:45"},{"$f":"'teacher-wise time-table'!$J$4","v":"10:25-10:55"},{"$f":"'teacher-wise time-table'!$J$2","v":5},{"$f":"VLOOKUP(E226,'teacher-wise time-table'!$A$5:$N$106,10)","v":"12th D CHEM. PR."},{"$f":"VLOOKUP(E226+1,'teacher-wise time-table'!$A$5:$N$106,10)","v":" D1 3,4  D2 5,6"}]
[{"$f":"'teacher-wise time-table'!$K$3","v":"10:45-11:20"},{"$f":"'teacher-wise time-table'!$K$4","v":"10:55-11:25"},{"$f":"'teacher-wise time-table'!$K$2","v":6},{"$f":"VLOOKUP(E226,'teacher-wise time-table'!$A$5:$N$106,11)","v":"12th D CHEM. PR."},{"$f":"VLOOKUP(E226+1,'teacher-wise time-table'!$A$5:$N$106,11)","v":" D1 3,4  D2 5,6, 12th E+A RAJ ST 2 AM"}]
[{"$f":"'teacher-wise time-table'!$L$3","v":"11:20-11:55"},{"$f":"'teacher-wise time-table'!$L$4","v":"11:25-11:55"},{"$f":"'teacher-wise time-table'!$L$2","v":7},{"$f":"VLOOKUP(E226,'teacher-wise time-table'!$A$5:$N$106,12)","v":"11th D CHEM . PR."},{"$f":"VLOOKUP(E226+1,'teacher-wise time-table'!$A$5:$N$106,12)","v":" D1 5,6  D2 1,2,12th E+A RAJ STD 3 AM"}]
[{"$f":"'teacher-wise time-table'!$M$3","v":"11:55-12:25"},{"$f":"'teacher-wise time-table'!$M$4","v":"11:55-12:25"},{"$f":"'teacher-wise time-table'!$M$2","v":8},{"$f":"VLOOKUP(E226,'teacher-wise time-table'!$A$5:$N$106,13)","v":"11th D CHEM . PR."},{"$f":"VLOOKUP(E226+1,'teacher-wise time-table'!$A$5:$N$106,13)","v":" D1 5,6  D2 1,2, 12th E+A RAJ STD 4 AM"}]
["SIGN. OF THE PRINCIPAL",null,null,{"$f":"'teacher-wise time-table'!$N$2","v":"TTL PERIODS PER WEEK"},{"$f":"VLOOKUP(E226,'teacher-wise time-table'!$A$5:$N$106,14)","v":19}]
[{"$f":"'teacher-wise time-table'!$B$1","v":"GOVT. GIRLS' HR. SEC. SCHOOL, NIMBAHERA,                                                  TEACHER-WISE TIME TABLE FOR THE YEAR 2014-15"},null,null,null,{"$f":"E226+3","v":49}]
[]
[{"$f":"'teacher-wise time-table'!$D$3","v":"SUMMER TIMINGS"},{"$f":"'teacher-wise time-table'!$D$4","v":"WINTER TIMINGS"},{"$f":"'teacher-wise time-table'!$D$2","v":"PERIOD"},{"$f":"VLOOKUP(E241,'teacher-wise time-table'!$A$5:$N$106,2)","v":"MR. N"},{"$f":"VLOOKUP(E241,'teacher-wise time-table'!$A$5:$N$106,3)","v":"LAB. ASSTT., PHYSICS"}]
[]
[{"$f":"'teacher-wise time-table'!$B$3","v":"7:00-7:20"},{"$f":"'teacher-wise time-table'!$B$4","v":"7:30-7:50"},{"$f":"'teacher-wise time-table'!$B$2","v":"PRAYER"},{"$f":"VLOOKUP(E241,'teacher-wise time-table'!$A$5:$N$106,4)","v":"CLASS TEACHER       11 E"}]
[{"$f":"'teacher-wise time-table'!$E$3","v":"07:20-07:55"},{"$f":"'teacher-wise time-table'!$E$4","v":"07:50-08:25"},{"$f":"'teacher-wise time-table'!$E$2","v":1},{"$f":"VLOOKUP(E241,'teacher-wise time-table'!$A$5:$N$106,5)","v":0},{"$f":"VLOOKUP(E241+1,'teacher-wise time-table'!$A$5:$N$106,5)","v":0}]
[{"$f":"'teacher-wise time-table'!$F$3","v":"07:55-08:30"},{"$f":"'teacher-wise time-table'!$F$4","v":"08:25-08:55"},{"$f":"'teacher-wise time-table'!$F$2","v":2},{"$f":"VLOOKUP(E241,'teacher-wise time-table'!$A$5:$N$106,6)","v":0},{"$f":"VLOOKUP(E241+1,'teacher-wise time-table'!$A$5:$N$106,6)","v":0}]
[{"$f":"'teacher-wise time-table'!$G$3","v":"08:30-09:05"},{"$f":"'teacher-wise time-table'!$G$4","v":"08:55-09:25"},{"$f":"'teacher-wise time-table'!$G$2","v":3},{"$f":"VLOOKUP(E241,'teacher-wise time-table'!$A$5:$N$106,7)","v":0},{"$f":"VLOOKUP(E241+1,'teacher-wise time-table'!$A$5:$N$106,7)","v":0}]
[{"$f":"'teacher-wise time-table'!$H$3","v":"09:05-09:40"},{"$f":"'teacher-wise time-table'!$H$4","v":"09:25-09:55"},{"$f":"'teacher-wise time-table'!$H$2","v":4},{"$f":"VLOOKUP(E241,'teacher-wise time-table'!$A$5:$N$106,8)","v":"11th D"},{"$f":"VLOOKUP(E241+1,'teacher-wise time-table'!$A$5:$N$106,8)","v":"RAJ ST 1-3 JK 4-6"}]
[{"$f":"'teacher-wise time-table'!$I$6","v":"09:40-10:10         "},{"$f":"'teacher-wise time-table'!$I$11","v":"09:55-10:25"},{"$f":"'teacher-wise time-table'!$I$2","v":" BREAK      "}]
[{"$f":"'teacher-wise time-table'!$J$3","v":"10:10-10:45"},{"$f":"'teacher-wise time-table'!$J$4","v":"10:25-10:55"},{"$f":"'teacher-wise time-table'!$J$2","v":5},{"$f":"VLOOKUP(E241,'teacher-wise time-table'!$A$5:$N$106,10)","v":"12th D PHY. PR."},{"$f":"VLOOKUP(E241+1,'teacher-wise time-table'!$A$5:$N$106,10)","v":" D1 5,6  D2 1,2"}]
[{"$f":"'teacher-wise time-table'!$K$3","v":"10:45-11:20"},{"$f":"'teacher-wise time-table'!$K$4","v":"10:55-11:25"},{"$f":"'teacher-wise time-table'!$K$2","v":6},{"$f":"VLOOKUP(E241,'teacher-wise time-table'!$A$5:$N$106,11)","v":"12th D PHY. PR."},{"$f":"VLOOKUP(E241+1,'teacher-wise time-table'!$A$5:$N$106,11)","v":" D1 5,6  D2 1,2"}]
[{"$f":"'teacher-wise time-table'!$L$3","v":"11:20-11:55"},{"$f":"'teacher-wise time-table'!$L$4","v":"11:25-11:55"},{"$f":"'teacher-wise time-table'!$L$2","v":7},{"$f":"VLOOKUP(E241,'teacher-wise time-table'!$A$5:$N$106,12)","v":"11th D PHY. PR."},{"$f":"VLOOKUP(E241+1,'teacher-wise time-table'!$A$5:$N$106,12)","v":" D1 1,2  D2 3,4"}]
[{"$f":"'teacher-wise time-table'!$M$3","v":"11:55-12:25"},{"$f":"'teacher-wise time-table'!$M$4","v":"11:55-12:25"},{"$f":"'teacher-wise time-table'!$M$2","v":8},{"$f":"VLOOKUP(E241,'teacher-wise time-table'!$A$5:$N$106,13)","v":0},{"$f":"VLOOKUP(E241+1,'teacher-wise time-table'!$A$5:$N$106,13)","v":" D1 1,2  D2 3,4,11 C+B  RAJ STD 5,6"}]
["SIGN. OF THE PRINCIPAL",null,null,{"$f":"'teacher-wise time-table'!$N$2","v":"TTL PERIODS PER WEEK"},{"$f":"VLOOKUP(E241,'teacher-wise time-table'!$A$5:$N$106,14)","v":"22+2"}]
[{"$f":"'teacher-wise time-table'!$B$1","v":"GOVT. GIRLS' HR. SEC. SCHOOL, NIMBAHERA,                                                  TEACHER-WISE TIME TABLE FOR THE YEAR 2014-15"},null,null,null,{"$f":"E241+3","v":52}]
[]
[{"$f":"'teacher-wise time-table'!$D$3","v":"SUMMER TIMINGS"},{"$f":"'teacher-wise time-table'!$D$4","v":"WINTER TIMINGS"},{"$f":"'teacher-wise time-table'!$D$2","v":"PERIOD"},{"$f":"VLOOKUP(E256,'teacher-wise time-table'!$A$5:$N$106,2)","v":0},{"$f":"VLOOKUP(E256,'teacher-wise time-table'!$A$5:$N$106,3)","v":0}]
[]
[{"$f":"'teacher-wise time-table'!$B$3","v":"7:00-7:20"},{"$f":"'teacher-wise time-table'!$B$4","v":"7:30-7:50"},{"$f":"'teacher-wise time-table'!$B$2","v":"PRAYER"},{"$f":"VLOOKUP(E256,'teacher-wise time-table'!$A$5:$N$106,4)","v":0}]
[{"$f":"'teacher-wise time-table'!$E$3","v":"07:20-07:55"},{"$f":"'teacher-wise time-table'!$E$4","v":"07:50-08:25"},{"$f":"'teacher-wise time-table'!$E$2","v":1},{"$f":"VLOOKUP(E256,'teacher-wise time-table'!$A$5:$N$106,5)","v":0},{"$f":"VLOOKUP(E256+1,'teacher-wise time-table'!$A$5:$N$106,5)","v":0}]
[{"$f":"'teacher-wise time-table'!$F$3","v":"07:55-08:30"},{"$f":"'teacher-wise time-table'!$F$4","v":"08:25-08:55"},{"$f":"'teacher-wise time-table'!$F$2","v":2},{"$f":"VLOOKUP(E256,'teacher-wise time-table'!$A$5:$N$106,6)","v":0},{"$f":"VLOOKUP(E256+1,'teacher-wise time-table'!$A$5:$N$106,6)","v":0}]
[{"$f":"'teacher-wise time-table'!$G$3","v":"08:30-09:05"},{"$f":"'teacher-wise time-table'!$G$4","v":"08:55-09:25"},{"$f":"'teacher-wise time-table'!$G$2","v":3},{"$f":"VLOOKUP(E256,'teacher-wise time-table'!$A$5:$N$106,7)","v":0},{"$f":"VLOOKUP(E256+1,'teacher-wise time-table'!$A$5:$N$106,7)","v":0}]
[{"$f":"'teacher-wise time-table'!$H$3","v":"09:05-09:40"},{"$f":"'teacher-wise time-table'!$H$4","v":"09:25-09:55"},{"$f":"'teacher-wise time-table'!$H$2","v":4},{"$f":"VLOOKUP(E256,'teacher-wise time-table'!$A$5:$N$106,8)","v":0},{"$f":"VLOOKUP(E256+1,'teacher-wise time-table'!$A$5:$N$106,8)","v":0}]
[{"$f":"'teacher-wise time-table'!$I$6","v":"09:40-10:10         "},{"$f":"'teacher-wise time-table'!$I$11","v":"09:55-10:25"},{"$f":"'teacher-wise time-table'!$I$2","v":" BREAK      "}]
[{"$f":"'teacher-wise time-table'!$J$3","v":"10:10-10:45"},{"$f":"'teacher-wise time-table'!$J$4","v":"10:25-10:55"},{"$f":"'teacher-wise time-table'!$J$2","v":5},{"$f":"VLOOKUP(E256,'teacher-wise time-table'!$A$5:$N$106,10)","v":0},{"$f":"VLOOKUP(E256+1,'teacher-wise time-table'!$A$5:$N$106,10)","v":0}]
[{"$f":"'teacher-wise time-table'!$K$3","v":"10:45-11:20"},{"$f":"'teacher-wise time-table'!$K$4","v":"10:55-11:25"},{"$f":"'teacher-wise time-table'!$K$2","v":6},{"$f":"VLOOKUP(E256,'teacher-wise time-table'!$A$5:$N$106,11)","v":0},{"$f":"VLOOKUP(E256+1,'teacher-wise time-table'!$A$5:$N$106,11)","v":0}]
[{"$f":"'teacher-wise time-table'!$L$3","v":"11:20-11:55"},{"$f":"'teacher-wise time-table'!$L$4","v":"11:25-11:55"},{"$f":"'teacher-wise time-table'!$L$2","v":7},{"$f":"VLOOKUP(E256,'teacher-wise time-table'!$A$5:$N$106,12)","v":0},{"$f":"VLOOKUP(E256+1,'teacher-wise time-table'!$A$5:$N$106,12)","v":0}]
[{"$f":"'teacher-wise time-table'!$M$3","v":"11:55-12:25"},{"$f":"'teacher-wise time-table'!$M$4","v":"11:55-12:25"},{"$f":"'teacher-wise time-table'!$M$2","v":8},{"$f":"VLOOKUP(E256,'teacher-wise time-table'!$A$5:$N$106,13)","v":0},{"$f":"VLOOKUP(E256+1,'teacher-wise time-table'!$A$5:$N$106,13)","v":0}]
["SIGN. OF THE PRINCIPAL",null,null,{"$f":"'teacher-wise time-table'!$N$2","v":"TTL PERIODS PER WEEK"},{"$f":"VLOOKUP(E256,'teacher-wise time-table'!$A$5:$N$106,14)","v":30}]
[{"$f":"'teacher-wise time-table'!$B$1","v":"GOVT. GIRLS' HR. SEC. SCHOOL, NIMBAHERA,                                                  TEACHER-WISE TIME TABLE FOR THE YEAR 2014-15"},null,null,null,{"$f":"E256+3","v":55}]
[]
[{"$f":"'teacher-wise time-table'!$D$3","v":"SUMMER TIMINGS"},{"$f":"'teacher-wise time-table'!$D$4","v":"WINTER TIMINGS"},{"$f":"'teacher-wise time-table'!$D$2","v":"PERIOD"},{"$f":"VLOOKUP(E271,'teacher-wise time-table'!$A$5:$N$106,2)","v":0},{"$f":"VLOOKUP(E271,'teacher-wise time-table'!$A$5:$N$106,3)","v":0}]
[]
[{"$f":"'teacher-wise time-table'!$B$3","v":"7:00-7:20"},{"$f":"'teacher-wise time-table'!$B$4","v":"7:30-7:50"},{"$f":"'teacher-wise time-table'!$B$2","v":"PRAYER"},{"$f":"VLOOKUP(E271,'teacher-wise time-table'!$A$5:$N$106,4)","v":0}]
[{"$f":"'teacher-wise time-table'!$E$3","v":"07:20-07:55"},{"$f":"'teacher-wise time-table'!$E$4","v":"07:50-08:25"},{"$f":"'teacher-wise time-table'!$E$2","v":1},{"$f":"VLOOKUP(E271,'teacher-wise time-table'!$A$5:$N$106,5)","v":0},{"$f":"VLOOKUP(E271+1,'teacher-wise time-table'!$A$5:$N$106,5)","v":0}]
[{"$f":"'teacher-wise time-table'!$F$3","v":"07:55-08:30"},{"$f":"'teacher-wise time-table'!$F$4","v":"08:25-08:55"},{"$f":"'teacher-wise time-table'!$F$2","v":2},{"$f":"VLOOKUP(E271,'teacher-wise time-table'!$A$5:$N$106,6)","v":0},{"$f":"VLOOKUP(E271+1,'teacher-wise time-table'!$A$5:$N$106,6)","v":0}]
[{"$f":"'teacher-wise time-table'!$G$3","v":"08:30-09:05"},{"$f":"'teacher-wise time-table'!$G$4","v":"08:55-09:25"},{"$f":"'teacher-wise time-table'!$G$2","v":3},{"$f":"VLOOKUP(E271,'teacher-wise time-table'!$A$5:$N$106,7)","v":0},{"$f":"VLOOKUP(E271+1,'teacher-wise time-table'!$A$5:$N$106,7)","v":0}]
[{"$f":"'teacher-wise time-table'!$H$3","v":"09:05-09:40"},{"$f":"'teacher-wise time-table'!$H$4","v":"09:25-09:55"},{"$f":"'teacher-wise time-table'!$H$2","v":4},{"$f":"VLOOKUP(E271,'teacher-wise time-table'!$A$5:$N$106,8)","v":0},{"$f":"VLOOKUP(E271+1,'teacher-wise time-table'!$A$5:$N$106,8)","v":0}]
[{"$f":"'teacher-wise time-table'!$I$6","v":"09:40-10:10         "},{"$f":"'teacher-wise time-table'!$I$11","v":"09:55-10:25"},{"$f":"'teacher-wise time-table'!$I$2","v":" BREAK      "}]
[{"$f":"'teacher-wise time-table'!$J$3","v":"10:10-10:45"},{"$f":"'teacher-wise time-table'!$J$4","v":"10:25-10:55"},{"$f":"'teacher-wise time-table'!$J$2","v":5},{"$f":"VLOOKUP(E271,'teacher-wise time-table'!$A$5:$N$106,10)","v":0},{"$f":"VLOOKUP(E271+1,'teacher-wise time-table'!$A$5:$N$106,10)","v":0}]
[{"$f":"'teacher-wise time-table'!$K$3","v":"10:45-11:20"},{"$f":"'teacher-wise time-table'!$K$4","v":"10:55-11:25"},{"$f":"'teacher-wise time-table'!$K$2","v":6},{"$f":"VLOOKUP(E271,'teacher-wise time-table'!$A$5:$N$106,11)","v":0},{"$f":"VLOOKUP(E271+1,'teacher-wise time-table'!$A$5:$N$106,11)","v":0}]
[{"$f":"'teacher-wise time-table'!$L$3","v":"11:20-11:55"},{"$f":"'teacher-wise time-table'!$L$4","v":"11:25-11:55"},{"$f":"'teacher-wise time-table'!$L$2","v":7},{"$f":"VLOOKUP(E271,'teacher-wise time-table'!$A$5:$N$106,12)","v":0},{"$f":"VLOOKUP(E271+1,'teacher-wise time-table'!$A$5:$N$106,12)","v":0}]
[{"$f":"'teacher-wise time-table'!$M$3","v":"11:55-12:25"},{"$f":"'teacher-wise time-table'!$M$4","v":"11:55-12:25"},{"$f":"'teacher-wise time-table'!$M$2","v":8},{"$f":"VLOOKUP(E271,'teacher-wise time-table'!$A$5:$N$106,13)","v":0},{"$f":"VLOOKUP(E271+1,'teacher-wise time-table'!$A$5:$N$106,13)","v":0}]
["SIGN. OF THE PRINCIPAL",null,null,{"$f":"'teacher-wise time-table'!$N$2","v":"TTL PERIODS PER WEEK"},{"$f":"VLOOKUP(E271,'teacher-wise time-table'!$A$5:$N$106,14)","v":18}]
[{"$f":"'teacher-wise time-table'!$B$1","v":"GOVT. GIRLS' HR. SEC. SCHOOL, NIMBAHERA,                                                  TEACHER-WISE TIME TABLE FOR THE YEAR 2014-15"},null,null,null,{"$f":"E271+3","v":58}]
[]
[{"$f":"'teacher-wise time-table'!$D$3","v":"SUMMER TIMINGS"},{"$f":"'teacher-wise time-table'!$D$4","v":"WINTER TIMINGS"},{"$f":"'teacher-wise time-table'!$D$2","v":"PERIOD"},{"$f":"VLOOKUP(E286,'teacher-wise time-table'!$A$5:$N$106,2)","v":0},{"$f":"VLOOKUP(E286,'teacher-wise time-table'!$A$5:$N$106,3)","v":0}]
[]
[{"$f":"'teacher-wise time-table'!$B$3","v":"7:00-7:20"},{"$f":"'teacher-wise time-table'!$B$4","v":"7:30-7:50"},{"$f":"'teacher-wise time-table'!$B$2","v":"PRAYER"},{"$f":"VLOOKUP(E286,'teacher-wise time-table'!$A$5:$N$106,4)","v":0}]
[{"$f":"'teacher-wise time-table'!$E$3","v":"07:20-07:55"},{"$f":"'teacher-wise time-table'!$E$4","v":"07:50-08:25"},{"$f":"'teacher-wise time-table'!$E$2","v":1},{"$f":"VLOOKUP(E286,'teacher-wise time-table'!$A$5:$N$106,5)","v":0},{"$f":"VLOOKUP(E286+1,'teacher-wise time-table'!$A$5:$N$106,5)","v":0}]
[{"$f":"'teacher-wise time-table'!$F$3","v":"07:55-08:30"},{"$f":"'teacher-wise time-table'!$F$4","v":"08:25-08:55"},{"$f":"'teacher-wise time-table'!$F$2","v":2},{"$f":"VLOOKUP(E286,'teacher-wise time-table'!$A$5:$N$106,6)","v":0},{"$f":"VLOOKUP(E286+1,'teacher-wise time-table'!$A$5:$N$106,6)","v":0}]
[{"$f":"'teacher-wise time-table'!$G$3","v":"08:30-09:05"},{"$f":"'teacher-wise time-table'!$G$4","v":"08:55-09:25"},{"$f":"'teacher-wise time-table'!$G$2","v":3},{"$f":"VLOOKUP(E286,'teacher-wise time-table'!$A$5:$N$106,7)","v":0},{"$f":"VLOOKUP(E286+1,'teacher-wise time-table'!$A$5:$N$106,7)","v":0}]
[{"$f":"'teacher-wise time-table'!$H$3","v":"09:05-09:40"},{"$f":"'teacher-wise time-table'!$H$4","v":"09:25-09:55"},{"$f":"'teacher-wise time-table'!$H$2","v":4},{"$f":"VLOOKUP(E286,'teacher-wise time-table'!$A$5:$N$106,8)","v":0},{"$f":"VLOOKUP(E286+1,'teacher-wise time-table'!$A$5:$N$106,8)","v":0}]
[{"$f":"'teacher-wise time-table'!$I$6","v":"09:40-10:10         "},{"$f":"'teacher-wise time-table'!$I$11","v":"09:55-10:25"},{"$f":"'teacher-wise time-table'!$I$2","v":" BREAK      "}]
[{"$f":"'teacher-wise time-table'!$J$3","v":"10:10-10:45"},{"$f":"'teacher-wise time-table'!$J$4","v":"10:25-10:55"},{"$f":"'teacher-wise time-table'!$J$2","v":5},{"$f":"VLOOKUP(E286,'teacher-wise time-table'!$A$5:$N$106,10)","v":0},{"$f":"VLOOKUP(E286+1,'teacher-wise time-table'!$A$5:$N$106,10)","v":0}]
[{"$f":"'teacher-wise time-table'!$K$3","v":"10:45-11:20"},{"$f":"'teacher-wise time-table'!$K$4","v":"10:55-11:25"},{"$f":"'teacher-wise time-table'!$K$2","v":6},{"$f":"VLOOKUP(E286,'teacher-wise time-table'!$A$5:$N$106,11)","v":0},{"$f":"VLOOKUP(E286+1,'teacher-wise time-table'!$A$5:$N$106,11)","v":0}]
[{"$f":"'teacher-wise time-table'!$L$3","v":"11:20-11:55"},{"$f":"'teacher-wise time-table'!$L$4","v":"11:25-11:55"},{"$f":"'teacher-wise time-table'!$L$2","v":7},{"$f":"VLOOKUP(E286,'teacher-wise time-table'!$A$5:$N$106,12)","v":0},{"$f":"VLOOKUP(E286+1,'teacher-wise time-table'!$A$5:$N$106,12)","v":0}]
[{"$f":"'teacher-wise time-table'!$M$3","v":"11:55-12:25"},{"$f":"'teacher-wise time-table'!$M$4","v":"11:55-12:25"},{"$f":"'teacher-wise time-table'!$M$2","v":8},{"$f":"VLOOKUP(E286,'teacher-wise time-table'!$A$5:$N$106,13)","v":0},{"$f":"VLOOKUP(E286+1,'teacher-wise time-table'!$A$5:$N$106,13)","v":0}]
["SIGN. OF THE PRINCIPAL",null,null,{"$f":"'teacher-wise time-table'!$N$2","v":"TTL PERIODS PER WEEK"},{"$f":"VLOOKUP(E286,'teacher-wise time-table'!$A$5:$N$106,14)","v":"29+6"}]
[{"$f":"'teacher-wise time-table'!$B$1","v":"GOVT. GIRLS' HR. SEC. SCHOOL, NIMBAHERA,                                                  TEACHER-WISE TIME TABLE FOR THE YEAR 2014-15"},null,null,null,{"$f":"E286+3","v":61}]
[]
[{"$f":"'teacher-wise time-table'!$D$3","v":"SUMMER TIMINGS"},{"$f":"'teacher-wise time-table'!$D$4","v":"WINTER TIMINGS"},{"$f":"'teacher-wise time-table'!$D$2","v":"PERIOD"},{"$f":"VLOOKUP(E301,'teacher-wise time-table'!$A$5:$N$106,2)","v":0},{"$f":"VLOOKUP(E301,'teacher-wise time-table'!$A$5:$N$106,3)","v":0}]
[]
[{"$f":"'teacher-wise time-table'!$B$3","v":"7:00-7:20"},{"$f":"'teacher-wise time-table'!$B$4","v":"7:30-7:50"},{"$f":"'teacher-wise time-table'!$B$2","v":"PRAYER"},{"$f":"VLOOKUP(E301,'teacher-wise time-table'!$A$5:$N$106,4)","v":0}]
[{"$f":"'teacher-wise time-table'!$E$3","v":"07:20-07:55"},{"$f":"'teacher-wise time-table'!$E$4","v":"07:50-08:25"},{"$f":"'teacher-wise time-table'!$E$2","v":1},{"$f":"VLOOKUP(E301,'teacher-wise time-table'!$A$5:$N$106,5)","v":0},{"$f":"VLOOKUP(E301+1,'teacher-wise time-table'!$A$5:$N$106,5)","v":0}]
[{"$f":"'teacher-wise time-table'!$F$3","v":"07:55-08:30"},{"$f":"'teacher-wise time-table'!$F$4","v":"08:25-08:55"},{"$f":"'teacher-wise time-table'!$F$2","v":2},{"$f":"VLOOKUP(E301,'teacher-wise time-table'!$A$5:$N$106,6)","v":0},{"$f":"VLOOKUP(E301+1,'teacher-wise time-table'!$A$5:$N$106,6)","v":0}]
[{"$f":"'teacher-wise time-table'!$G$3","v":"08:30-09:05"},{"$f":"'teacher-wise time-table'!$G$4","v":"08:55-09:25"},{"$f":"'teacher-wise time-table'!$G$2","v":3},{"$f":"VLOOKUP(E301,'teacher-wise time-table'!$A$5:$N$106,7)","v":0},{"$f":"VLOOKUP(E301+1,'teacher-wise time-table'!$A$5:$N$106,7)","v":0}]
[{"$f":"'teacher-wise time-table'!$H$3","v":"09:05-09:40"},{"$f":"'teacher-wise time-table'!$H$4","v":"09:25-09:55"},{"$f":"'teacher-wise time-table'!$H$2","v":4},{"$f":"VLOOKUP(E301,'teacher-wise time-table'!$A$5:$N$106,8)","v":0},{"$f":"VLOOKUP(E301+1,'teacher-wise time-table'!$A$5:$N$106,8)","v":0}]
[{"$f":"'teacher-wise time-table'!$I$6","v":"09:40-10:10         "},{"$f":"'teacher-wise time-table'!$I$11","v":"09:55-10:25"},{"$f":"'teacher-wise time-table'!$I$2","v":" BREAK      "}]
[{"$f":"'teacher-wise time-table'!$J$3","v":"10:10-10:45"},{"$f":"'teacher-wise time-table'!$J$4","v":"10:25-10:55"},{"$f":"'teacher-wise time-table'!$J$2","v":5},{"$f":"VLOOKUP(E301,'teacher-wise time-table'!$A$5:$N$106,10)","v":0},{"$f":"VLOOKUP(E301+1,'teacher-wise time-table'!$A$5:$N$106,10)","v":0}]
[{"$f":"'teacher-wise time-table'!$K$3","v":"10:45-11:20"},{"$f":"'teacher-wise time-table'!$K$4","v":"10:55-11:25"},{"$f":"'teacher-wise time-table'!$K$2","v":6},{"$f":"VLOOKUP(E301,'teacher-wise time-table'!$A$5:$N$106,11)","v":0},{"$f":"VLOOKUP(E301+1,'teacher-wise time-table'!$A$5:$N$106,11)","v":0}]
[{"$f":"'teacher-wise time-table'!$L$3","v":"11:20-11:55"},{"$f":"'teacher-wise time-table'!$L$4","v":"11:25-11:55"},{"$f":"'teacher-wise time-table'!$L$2","v":7},{"$f":"VLOOKUP(E301,'teacher-wise time-table'!$A$5:$N$106,12)","v":0},{"$f":"VLOOKUP(E301+1,'teacher-wise time-table'!$A$5:$N$106,12)","v":0}]
[{"$f":"'teacher-wise time-table'!$M$3","v":"11:55-12:25"},{"$f":"'teacher-wise time-table'!$M$4","v":"11:55-12:25"},{"$f":"'teacher-wise time-table'!$M$2","v":8},{"$f":"VLOOKUP(E301,'teacher-wise time-table'!$A$5:$N$106,13)","v":0},{"$f":"VLOOKUP(E301+1,'teacher-wise time-table'!$A$5:$N$106,13)","v":0}]
["SIGN. OF THE PRINCIPAL",null,null,{"$f":"'teacher-wise time-table'!$N$2","v":"TTL PERIODS PER WEEK"},{"$f":"VLOOKUP(E301,'teacher-wise time-table'!$A$5:$N$106,14)","v":"29+6"}]
[{"$f":"'teacher-wise time-table'!$B$1","v":"GOVT. GIRLS' HR. SEC. SCHOOL, NIMBAHERA,                                                  TEACHER-WISE TIME TABLE FOR THE YEAR 2014-15"},null,null,null,{"$f":"E301+3","v":64}]
[]
[{"$f":"'teacher-wise time-table'!$D$3","v":"SUMMER TIMINGS"},{"$f":"'teacher-wise time-table'!$D$4","v":"WINTER TIMINGS"},{"$f":"'teacher-wise time-table'!$D$2","v":"PERIOD"},{"$f":"VLOOKUP(E316,'teacher-wise time-table'!$A$5:$N$106,2)","v":0},{"$f":"VLOOKUP(E316,'teacher-wise time-table'!$A$5:$N$106,3)","v":0}]
[]
[{"$f":"'teacher-wise time-table'!$B$3","v":"7:00-7:20"},{"$f":"'teacher-wise time-table'!$B$4","v":"7:30-7:50"},{"$f":"'teacher-wise time-table'!$B$2","v":"PRAYER"},{"$f":"VLOOKUP(E316,'teacher-wise time-table'!$A$5:$N$106,4)","v":0}]
[{"$f":"'teacher-wise time-table'!$E$3","v":"07:20-07:55"},{"$f":"'teacher-wise time-table'!$E$4","v":"07:50-08:25"},{"$f":"'teacher-wise time-table'!$E$2","v":1},{"$f":"VLOOKUP(E316,'teacher-wise time-table'!$A$5:$N$106,5)","v":0},{"$f":"VLOOKUP(E316+1,'teacher-wise time-table'!$A$5:$N$106,5)","v":0}]
[{"$f":"'teacher-wise time-table'!$F$3","v":"07:55-08:30"},{"$f":"'teacher-wise time-table'!$F$4","v":"08:25-08:55"},{"$f":"'teacher-wise time-table'!$F$2","v":2},{"$f":"VLOOKUP(E316,'teacher-wise time-table'!$A$5:$N$106,6)","v":0},{"$f":"VLOOKUP(E316+1,'teacher-wise time-table'!$A$5:$N$106,6)","v":0}]
[{"$f":"'teacher-wise time-table'!$G$3","v":"08:30-09:05"},{"$f":"'teacher-wise time-table'!$G$4","v":"08:55-09:25"},{"$f":"'teacher-wise time-table'!$G$2","v":3},{"$f":"VLOOKUP(E316,'teacher-wise time-table'!$A$5:$N$106,7)","v":0},{"$f":"VLOOKUP(E316+1,'teacher-wise time-table'!$A$5:$N$106,7)","v":0}]
[{"$f":"'teacher-wise time-table'!$H$3","v":"09:05-09:40"},{"$f":"'teacher-wise time-table'!$H$4","v":"09:25-09:55"},{"$f":"'teacher-wise time-table'!$H$2","v":4},{"$f":"VLOOKUP(E316,'teacher-wise time-table'!$A$5:$N$106,8)","v":0},{"$f":"VLOOKUP(E316+1,'teacher-wise time-table'!$A$5:$N$106,8)","v":0}]
[{"$f":"'teacher-wise time-table'!$I$6","v":"09:40-10:10         "},{"$f":"'teacher-wise time-table'!$I$11","v":"09:55-10:25"},{"$f":"'teacher-wise time-table'!$I$2","v":" BREAK      "}]
[{"$f":"'teacher-wise time-table'!$J$3","v":"10:10-10:45"},{"$f":"'teacher-wise time-table'!$J$4","v":"10:25-10:55"},{"$f":"'teacher-wise time-table'!$J$2","v":5},{"$f":"VLOOKUP(E316,'teacher-wise time-table'!$A$5:$N$106,10)","v":0},{"$f":"VLOOKUP(E316+1,'teacher-wise time-table'!$A$5:$N$106,10)","v":0}]
[{"$f":"'teacher-wise time-table'!$K$3","v":"10:45-11:20"},{"$f":"'teacher-wise time-table'!$K$4","v":"10:55-11:25"},{"$f":"'teacher-wise time-table'!$K$2","v":6},{"$f":"VLOOKUP(E316,'teacher-wise time-table'!$A$5:$N$106,11)","v":0},{"$f":"VLOOKUP(E316+1,'teacher-wise time-table'!$A$5:$N$106,11)","v":0}]
[{"$f":"'teacher-wise time-table'!$L$3","v":"11:20-11:55"},{"$f":"'teacher-wise time-table'!$L$4","v":"11:25-11:55"},{"$f":"'teacher-wise time-table'!$L$2","v":7},{"$f":"VLOOKUP(E316,'teacher-wise time-table'!$A$5:$N$106,12)","v":0},{"$f":"VLOOKUP(E316+1,'teacher-wise time-table'!$A$5:$N$106,12)","v":0}]
[{"$f":"'teacher-wise time-table'!$M$3","v":"11:55-12:25"},{"$f":"'teacher-wise time-table'!$M$4","v":"11:55-12:25"},{"$f":"'teacher-wise time-table'!$M$2","v":8},{"$f":"VLOOKUP(E316,'teacher-wise time-table'!$A$5:$N$106,13)","v":0},{"$f":"VLOOKUP(E316+1,'teacher-wise time-table'!$A$5:$N$106,13)","v":0}]
["SIGN. OF THE PRINCIPAL",null,null,{"$f":"'teacher-wise time-table'!$N$2","v":"TTL PERIODS PER WEEK"},{"$f":"VLOOKUP(E316,'teacher-wise time-table'!$A$5:$N$106,14)","v":"29+5"}]
[{"$f":"'teacher-wise time-table'!$B$1","v":"GOVT. GIRLS' HR. SEC. SCHOOL, NIMBAHERA,                                                  TEACHER-WISE TIME TABLE FOR THE YEAR 2014-15"},null,null,null,{"$f":"E316+3","v":67}]
[]
[{"$f":"'teacher-wise time-table'!$D$3","v":"SUMMER TIMINGS"},{"$f":"'teacher-wise time-table'!$D$4","v":"WINTER TIMINGS"},{"$f":"'teacher-wise time-table'!$D$2","v":"PERIOD"},{"$f":"VLOOKUP(E331,'teacher-wise time-table'!$A$5:$N$106,2)","v":0},{"$f":"VLOOKUP(E331,'teacher-wise time-table'!$A$5:$N$106,3)","v":0}]
[]
[{"$f":"'teacher-wise time-table'!$B$3","v":"7:00-7:20"},{"$f":"'teacher-wise time-table'!$B$4","v":"7:30-7:50"},{"$f":"'teacher-wise time-table'!$B$2","v":"PRAYER"},{"$f":"VLOOKUP(E331,'teacher-wise time-table'!$A$5:$N$106,4)","v":0}]
[{"$f":"'teacher-wise time-table'!$E$3","v":"07:20-07:55"},{"$f":"'teacher-wise time-table'!$E$4","v":"07:50-08:25"},{"$f":"'teacher-wise time-table'!$E$2","v":1},{"$f":"VLOOKUP(E331,'teacher-wise time-table'!$A$5:$N$106,5)","v":0},{"$f":"VLOOKUP(E331+1,'teacher-wise time-table'!$A$5:$N$106,5)","v":0}]
[{"$f":"'teacher-wise time-table'!$F$3","v":"07:55-08:30"},{"$f":"'teacher-wise time-table'!$F$4","v":"08:25-08:55"},{"$f":"'teacher-wise time-table'!$F$2","v":2},{"$f":"VLOOKUP(E331,'teacher-wise time-table'!$A$5:$N$106,6)","v":0},{"$f":"VLOOKUP(E331+1,'teacher-wise time-table'!$A$5:$N$106,6)","v":0}]
[{"$f":"'teacher-wise time-table'!$G$3","v":"08:30-09:05"},{"$f":"'teacher-wise time-table'!$G$4","v":"08:55-09:25"},{"$f":"'teacher-wise time-table'!$G$2","v":3},{"$f":"VLOOKUP(E331,'teacher-wise time-table'!$A$5:$N$106,7)","v":0},{"$f":"VLOOKUP(E331+1,'teacher-wise time-table'!$A$5:$N$106,7)","v":0}]
[{"$f":"'teacher-wise time-table'!$H$3","v":"09:05-09:40"},{"$f":"'teacher-wise time-table'!$H$4","v":"09:25-09:55"},{"$f":"'teacher-wise time-table'!$H$2","v":4},{"$f":"VLOOKUP(E331,'teacher-wise time-table'!$A$5:$N$106,8)","v":0},{"$f":"VLOOKUP(E331+1,'teacher-wise time-table'!$A$5:$N$106,8)","v":0}]
[{"$f":"'teacher-wise time-table'!$I$6","v":"09:40-10:10         "},{"$f":"'teacher-wise time-table'!$I$11","v":"09:55-10:25"},{"$f":"'teacher-wise time-table'!$I$2","v":" BREAK      "}]
[{"$f":"'teacher-wise time-table'!$J$3","v":"10:10-10:45"},{"$f":"'teacher-wise time-table'!$J$4","v":"10:25-10:55"},{"$f":"'teacher-wise time-table'!$J$2","v":5},{"$f":"VLOOKUP(E331,'teacher-wise time-table'!$A$5:$N$106,10)","v":0},{"$f":"VLOOKUP(E331+1,'teacher-wise time-table'!$A$5:$N$106,10)","v":0}]
[{"$f":"'teacher-wise time-table'!$K$3","v":"10:45-11:20"},{"$f":"'teacher-wise time-table'!$K$4","v":"10:55-11:25"},{"$f":"'teacher-wise time-table'!$K$2","v":6},{"$f":"VLOOKUP(E331,'teacher-wise time-table'!$A$5:$N$106,11)","v":0},{"$f":"VLOOKUP(E331+1,'teacher-wise time-table'!$A$5:$N$106,11)","v":0}]
[{"$f":"'teacher-wise time-table'!$L$3","v":"11:20-11:55"},{"$f":"'teacher-wise time-table'!$L$4","v":"11:25-11:55"},{"$f":"'teacher-wise time-table'!$L$2","v":7},{"$f":"VLOOKUP(E331,'teacher-wise time-table'!$A$5:$N$106,12)","v":0},{"$f":"VLOOKUP(E331+1,'teacher-wise time-table'!$A$5:$N$106,12)","v":0}]
[{"$f":"'teacher-wise time-table'!$M$3","v":"11:55-12:25"},{"$f":"'teacher-wise time-table'!$M$4","v":"11:55-12:25"},{"$f":"'teacher-wise time-table'!$M$2","v":8},{"$f":"VLOOKUP(E331,'teacher-wise time-table'!$A$5:$N$106,13)","v":0},{"$f":"VLOOKUP(E331+1,'teacher-wise time-table'!$A$5:$N$106,13)","v":0}]
["SIGN. OF THE PRINCIPAL",null,null,{"$f":"'teacher-wise time-table'!$N$2","v":"TTL PERIODS PER WEEK"},{"$f":"VLOOKUP(E331,'teacher-wise time-table'!$A$5:$N$106,14)","v":"28+4"}]
[{"$f":"'teacher-wise time-table'!$B$1","v":"GOVT. GIRLS' HR. SEC. SCHOOL, NIMBAHERA,                                                  TEACHER-WISE TIME TABLE FOR THE YEAR 2014-15"},null,null,null,{"$f":"E331+3","v":70}]
[]
[{"$f":"'teacher-wise time-table'!$D$3","v":"SUMMER TIMINGS"},{"$f":"'teacher-wise time-table'!$D$4","v":"WINTER TIMINGS"},{"$f":"'teacher-wise time-table'!$D$2","v":"PERIOD"},{"$f":"VLOOKUP(E346,'teacher-wise time-table'!$A$5:$N$106,2)","v":0},{"$f":"VLOOKUP(E346,'teacher-wise time-table'!$A$5:$N$106,3)","v":0}]
[]
[{"$f":"'teacher-wise time-table'!$B$3","v":"7:00-7:20"},{"$f":"'teacher-wise time-table'!$B$4","v":"7:30-7:50"},{"$f":"'teacher-wise time-table'!$B$2","v":"PRAYER"},{"$f":"VLOOKUP(E346,'teacher-wise time-table'!$A$5:$N$106,4)","v":0}]
[{"$f":"'teacher-wise time-table'!$E$3","v":"07:20-07:55"},{"$f":"'teacher-wise time-table'!$E$4","v":"07:50-08:25"},{"$f":"'teacher-wise time-table'!$E$2","v":1},{"$f":"VLOOKUP(E346,'teacher-wise time-table'!$A$5:$N$106,5)","v":0},{"$f":"VLOOKUP(E346+1,'teacher-wise time-table'!$A$5:$N$106,5)","v":0}]
[{"$f":"'teacher-wise time-table'!$F$3","v":"07:55-08:30"},{"$f":"'teacher-wise time-table'!$F$4","v":"08:25-08:55"},{"$f":"'teacher-wise time-table'!$F$2","v":2},{"$f":"VLOOKUP(E346,'teacher-wise time-table'!$A$5:$N$106,6)","v":0},{"$f":"VLOOKUP(E346+1,'teacher-wise time-table'!$A$5:$N$106,6)","v":0}]
[{"$f":"'teacher-wise time-table'!$G$3","v":"08:30-09:05"},{"$f":"'teacher-wise time-table'!$G$4","v":"08:55-09:25"},{"$f":"'teacher-wise time-table'!$G$2","v":3},{"$f":"VLOOKUP(E346,'teacher-wise time-table'!$A$5:$N$106,7)","v":0},{"$f":"VLOOKUP(E346+1,'teacher-wise time-table'!$A$5:$N$106,7)","v":0}]
[{"$f":"'teacher-wise time-table'!$H$3","v":"09:05-09:40"},{"$f":"'teacher-wise time-table'!$H$4","v":"09:25-09:55"},{"$f":"'teacher-wise time-table'!$H$2","v":4},{"$f":"VLOOKUP(E346,'teacher-wise time-table'!$A$5:$N$106,8)","v":0},{"$f":"VLOOKUP(E346+1,'teacher-wise time-table'!$A$5:$N$106,8)","v":0}]
[{"$f":"'teacher-wise time-table'!$I$6","v":"09:40-10:10         "},{"$f":"'teacher-wise time-table'!$I$11","v":"09:55-10:25"},{"$f":"'teacher-wise time-table'!$I$2","v":" BREAK      "}]
[{"$f":"'teacher-wise time-table'!$J$3","v":"10:10-10:45"},{"$f":"'teacher-wise time-table'!$J$4","v":"10:25-10:55"},{"$f":"'teacher-wise time-table'!$J$2","v":5},{"$f":"VLOOKUP(E346,'teacher-wise time-table'!$A$5:$N$106,10)","v":0},{"$f":"VLOOKUP(E346+1,'teacher-wise time-table'!$A$5:$N$106,10)","v":0}]
[{"$f":"'teacher-wise time-table'!$K$3","v":"10:45-11:20"},{"$f":"'teacher-wise time-table'!$K$4","v":"10:55-11:25"},{"$f":"'teacher-wise time-table'!$K$2","v":6},{"$f":"VLOOKUP(E346,'teacher-wise time-table'!$A$5:$N$106,11)","v":0},{"$f":"VLOOKUP(E346+1,'teacher-wise time-table'!$A$5:$N$106,11)","v":0}]
[{"$f":"'teacher-wise time-table'!$L$3","v":"11:20-11:55"},{"$f":"'teacher-wise time-table'!$L$4","v":"11:25-11:55"},{"$f":"'teacher-wise time-table'!$L$2","v":7},{"$f":"VLOOKUP(E346,'teacher-wise time-table'!$A$5:$N$106,12)","v":0},{"$f":"VLOOKUP(E346+1,'teacher-wise time-table'!$A$5:$N$106,12)","v":0}]
[{"$f":"'teacher-wise time-table'!$M$3","v":"11:55-12:25"},{"$f":"'teacher-wise time-table'!$M$4","v":"11:55-12:25"},{"$f":"'teacher-wise time-table'!$M$2","v":8},{"$f":"VLOOKUP(E346,'teacher-wise time-table'!$A$5:$N$106,13)","v":0},{"$f":"VLOOKUP(E346+1,'teacher-wise time-table'!$A$5:$N$106,13)","v":0}]
["SIGN. OF THE PRINCIPAL",null,null,{"$f":"'teacher-wise time-table'!$N$2","v":"TTL PERIODS PER WEEK"},{"$f":"VLOOKUP(E346,'teacher-wise time-table'!$A$5:$N$106,14)","v":"30+4"}]
[{"$f":"'teacher-wise time-table'!$B$1","v":"GOVT. GIRLS' HR. SEC. SCHOOL, NIMBAHERA,                                                  TEACHER-WISE TIME TABLE FOR THE YEAR 2014-15"},null,null,null,{"$f":"E346+3","v":73}]
[]
[{"$f":"'teacher-wise time-table'!$D$3","v":"SUMMER TIMINGS"},{"$f":"'teacher-wise time-table'!$D$4","v":"WINTER TIMINGS"},{"$f":"'teacher-wise time-table'!$D$2","v":"PERIOD"},{"$f":"VLOOKUP(E361,'teacher-wise time-table'!$A$5:$N$106,2)","v":0},{"$f":"VLOOKUP(E361,'teacher-wise time-table'!$A$5:$N$106,3)","v":0}]
[]
[{"$f":"'teacher-wise time-table'!$B$3","v":"7:00-7:20"},{"$f":"'teacher-wise time-table'!$B$4","v":"7:30-7:50"},{"$f":"'teacher-wise time-table'!$B$2","v":"PRAYER"},{"$f":"VLOOKUP(E361,'teacher-wise time-table'!$A$5:$N$106,4)","v":0}]
[{"$f":"'teacher-wise time-table'!$E$3","v":"07:20-07:55"},{"$f":"'teacher-wise time-table'!$E$4","v":"07:50-08:25"},{"$f":"'teacher-wise time-table'!$E$2","v":1},{"$f":"VLOOKUP(E361,'teacher-wise time-table'!$A$5:$N$106,5)","v":0},{"$f":"VLOOKUP(E361+1,'teacher-wise time-table'!$A$5:$N$106,5)","v":0}]
[{"$f":"'teacher-wise time-table'!$F$3","v":"07:55-08:30"},{"$f":"'teacher-wise time-table'!$F$4","v":"08:25-08:55"},{"$f":"'teacher-wise time-table'!$F$2","v":2},{"$f":"VLOOKUP(E361,'teacher-wise time-table'!$A$5:$N$106,6)","v":0},{"$f":"VLOOKUP(E361+1,'teacher-wise time-table'!$A$5:$N$106,6)","v":0}]
[{"$f":"'teacher-wise time-table'!$G$3","v":"08:30-09:05"},{"$f":"'teacher-wise time-table'!$G$4","v":"08:55-09:25"},{"$f":"'teacher-wise time-table'!$G$2","v":3},{"$f":"VLOOKUP(E361,'teacher-wise time-table'!$A$5:$N$106,7)","v":0},{"$f":"VLOOKUP(E361+1,'teacher-wise time-table'!$A$5:$N$106,7)","v":0}]
[{"$f":"'teacher-wise time-table'!$H$3","v":"09:05-09:40"},{"$f":"'teacher-wise time-table'!$H$4","v":"09:25-09:55"},{"$f":"'teacher-wise time-table'!$H$2","v":4},{"$f":"VLOOKUP(E361,'teacher-wise time-table'!$A$5:$N$106,8)","v":0},{"$f":"VLOOKUP(E361+1,'teacher-wise time-table'!$A$5:$N$106,8)","v":0}]
[{"$f":"'teacher-wise time-table'!$I$6","v":"09:40-10:10         "},{"$f":"'teacher-wise time-table'!$I$11","v":"09:55-10:25"},{"$f":"'teacher-wise time-table'!$I$2","v":" BREAK      "}]
[{"$f":"'teacher-wise time-table'!$J$3","v":"10:10-10:45"},{"$f":"'teacher-wise time-table'!$J$4","v":"10:25-10:55"},{"$f":"'teacher-wise time-table'!$J$2","v":5},{"$f":"VLOOKUP(E361,'teacher-wise time-table'!$A$5:$N$106,10)","v":0},{"$f":"VLOOKUP(E361+1,'teacher-wise time-table'!$A$5:$N$106,10)","v":0}]
[{"$f":"'teacher-wise time-table'!$K$3","v":"10:45-11:20"},{"$f":"'teacher-wise time-table'!$K$4","v":"10:55-11:25"},{"$f":"'teacher-wise time-table'!$K$2","v":6},{"$f":"VLOOKUP(E361,'teacher-wise time-table'!$A$5:$N$106,11)","v":0},{"$f":"VLOOKUP(E361+1,'teacher-wise time-table'!$A$5:$N$106,11)","v":0}]
[{"$f":"'teacher-wise time-table'!$L$3","v":"11:20-11:55"},{"$f":"'teacher-wise time-table'!$L$4","v":"11:25-11:55"},{"$f":"'teacher-wise time-table'!$L$2","v":7},{"$f":"VLOOKUP(E361,'teacher-wise time-table'!$A$5:$N$106,12)","v":0},{"$f":"VLOOKUP(E361+1,'teacher-wise time-table'!$A$5:$N$106,12)","v":0}]
[{"$f":"'teacher-wise time-table'!$M$3","v":"11:55-12:25"},{"$f":"'teacher-wise time-table'!$M$4","v":"11:55-12:25"},{"$f":"'teacher-wise time-table'!$M$2","v":8},{"$f":"VLOOKUP(E361,'teacher-wise time-table'!$A$5:$N$106,13)","v":0},{"$f":"VLOOKUP(E361+1,'teacher-wise time-table'!$A$5:$N$106,13)","v":0}]
["SIGN. OF THE PRINCIPAL",null,null,{"$f":"'teacher-wise time-table'!$N$2","v":"TTL PERIODS PER WEEK"},{"$f":"VLOOKUP(E361,'teacher-wise time-table'!$A$5:$N$106,14)","v":"28+5"}]
[{"$f":"'teacher-wise time-table'!$B$1","v":"GOVT. GIRLS' HR. SEC. SCHOOL, NIMBAHERA,                                                  TEACHER-WISE TIME TABLE FOR THE YEAR 2014-15"},null,null,null,{"$f":"E361+3","v":76}]
[]
[{"$f":"'teacher-wise time-table'!$D$3","v":"SUMMER TIMINGS"},{"$f":"'teacher-wise time-table'!$D$4","v":"WINTER TIMINGS"},{"$f":"'teacher-wise time-table'!$D$2","v":"PERIOD"},{"$f":"VLOOKUP(E376,'teacher-wise time-table'!$A$5:$N$106,2)","v":0},{"$f":"VLOOKUP(E376,'teacher-wise time-table'!$A$5:$N$106,3)","v":0}]
[]
[{"$f":"'teacher-wise time-table'!$B$3","v":"7:00-7:20"},{"$f":"'teacher-wise time-table'!$B$4","v":"7:30-7:50"},{"$f":"'teacher-wise time-table'!$B$2","v":"PRAYER"},{"$f":"VLOOKUP(E376,'teacher-wise time-table'!$A$5:$N$106,4)","v":0}]
[{"$f":"'teacher-wise time-table'!$E$3","v":"07:20-07:55"},{"$f":"'teacher-wise time-table'!$E$4","v":"07:50-08:25"},{"$f":"'teacher-wise time-table'!$E$2","v":1},{"$f":"VLOOKUP(E376,'teacher-wise time-table'!$A$5:$N$106,5)","v":0},{"$f":"VLOOKUP(E376+1,'teacher-wise time-table'!$A$5:$N$106,5)","v":0}]
[{"$f":"'teacher-wise time-table'!$F$3","v":"07:55-08:30"},{"$f":"'teacher-wise time-table'!$F$4","v":"08:25-08:55"},{"$f":"'teacher-wise time-table'!$F$2","v":2},{"$f":"VLOOKUP(E376,'teacher-wise time-table'!$A$5:$N$106,6)","v":0},{"$f":"VLOOKUP(E376+1,'teacher-wise time-table'!$A$5:$N$106,6)","v":0}]
[{"$f":"'teacher-wise time-table'!$G$3","v":"08:30-09:05"},{"$f":"'teacher-wise time-table'!$G$4","v":"08:55-09:25"},{"$f":"'teacher-wise time-table'!$G$2","v":3},{"$f":"VLOOKUP(E376,'teacher-wise time-table'!$A$5:$N$106,7)","v":0},{"$f":"VLOOKUP(E376+1,'teacher-wise time-table'!$A$5:$N$106,7)","v":0}]
[{"$f":"'teacher-wise time-table'!$H$3","v":"09:05-09:40"},{"$f":"'teacher-wise time-table'!$H$4","v":"09:25-09:55"},{"$f":"'teacher-wise time-table'!$H$2","v":4},{"$f":"VLOOKUP(E376,'teacher-wise time-table'!$A$5:$N$106,8)","v":0},{"$f":"VLOOKUP(E376+1,'teacher-wise time-table'!$A$5:$N$106,8)","v":0}]
[{"$f":"'teacher-wise time-table'!$I$6","v":"09:40-10:10         "},{"$f":"'teacher-wise time-table'!$I$11","v":"09:55-10:25"},{"$f":"'teacher-wise time-table'!$I$2","v":" BREAK      "}]
[{"$f":"'teacher-wise time-table'!$J$3","v":"10:10-10:45"},{"$f":"'teacher-wise time-table'!$J$4","v":"10:25-10:55"},{"$f":"'teacher-wise time-table'!$J$2","v":5},{"$f":"VLOOKUP(E376,'teacher-wise time-table'!$A$5:$N$106,10)","v":0},{"$f":"VLOOKUP(E376+1,'teacher-wise time-table'!$A$5:$N$106,10)","v":0}]
[{"$f":"'teacher-wise time-table'!$K$3","v":"10:45-11:20"},{"$f":"'teacher-wise time-table'!$K$4","v":"10:55-11:25"},{"$f":"'teacher-wise time-table'!$K$2","v":6},{"$f":"VLOOKUP(E376,'teacher-wise time-table'!$A$5:$N$106,11)","v":0},{"$f":"VLOOKUP(E376+1,'teacher-wise time-table'!$A$5:$N$106,11)","v":0}]
[{"$f":"'teacher-wise time-table'!$L$3","v":"11:20-11:55"},{"$f":"'teacher-wise time-table'!$L$4","v":"11:25-11:55"},{"$f":"'teacher-wise time-table'!$L$2","v":7},{"$f":"VLOOKUP(E376,'teacher-wise time-table'!$A$5:$N$106,12)","v":0},{"$f":"VLOOKUP(E376+1,'teacher-wise time-table'!$A$5:$N$106,12)","v":0}]
[{"$f":"'teacher-wise time-table'!$M$3","v":"11:55-12:25"},{"$f":"'teacher-wise time-table'!$M$4","v":"11:55-12:25"},{"$f":"'teacher-wise time-table'!$M$2","v":8},{"$f":"VLOOKUP(E376,'teacher-wise time-table'!$A$5:$N$106,13)","v":0},{"$f":"VLOOKUP(E376+1,'teacher-wise time-table'!$A$5:$N$106,13)","v":0}]
["SIGN. OF THE PRINCIPAL",null,null,{"$f":"'teacher-wise time-table'!$N$2","v":"TTL PERIODS PER WEEK"},{"$f":"VLOOKUP(E376,'teacher-wise time-table'!$A$5:$N$106,14)","v":21}]
[{"$f":"'teacher-wise time-table'!$B$1","v":"GOVT. GIRLS' HR. SEC. SCHOOL, NIMBAHERA,                                                  TEACHER-WISE TIME TABLE FOR THE YEAR 2014-15"},null,null,null,{"$f":"E376+3","v":79}]
[]
[{"$f":"'teacher-wise time-table'!$D$3","v":"SUMMER TIMINGS"},{"$f":"'teacher-wise time-table'!$D$4","v":"WINTER TIMINGS"},{"$f":"'teacher-wise time-table'!$D$2","v":"PERIOD"},{"$f":"VLOOKUP(E391,'teacher-wise time-table'!$A$5:$N$106,2)","v":0},{"$f":"VLOOKUP(E391,'teacher-wise time-table'!$A$5:$N$106,3)","v":0}]
[]
[{"$f":"'teacher-wise time-table'!$B$3","v":"7:00-7:20"},{"$f":"'teacher-wise time-table'!$B$4","v":"7:30-7:50"},{"$f":"'teacher-wise time-table'!$B$2","v":"PRAYER"},{"$f":"VLOOKUP(E391,'teacher-wise time-table'!$A$5:$N$106,4)","v":0}]
[{"$f":"'teacher-wise time-table'!$E$3","v":"07:20-07:55"},{"$f":"'teacher-wise time-table'!$E$4","v":"07:50-08:25"},{"$f":"'teacher-wise time-table'!$E$2","v":1},{"$f":"VLOOKUP(E391,'teacher-wise time-table'!$A$5:$N$106,5)","v":0},{"$f":"VLOOKUP(E391+1,'teacher-wise time-table'!$A$5:$N$106,5)","v":0}]
[{"$f":"'teacher-wise time-table'!$F$3","v":"07:55-08:30"},{"$f":"'teacher-wise time-table'!$F$4","v":"08:25-08:55"},{"$f":"'teacher-wise time-table'!$F$2","v":2},{"$f":"VLOOKUP(E391,'teacher-wise time-table'!$A$5:$N$106,6)","v":0},{"$f":"VLOOKUP(E391+1,'teacher-wise time-table'!$A$5:$N$106,6)","v":0}]
[{"$f":"'teacher-wise time-table'!$G$3","v":"08:30-09:05"},{"$f":"'teacher-wise time-table'!$G$4","v":"08:55-09:25"},{"$f":"'teacher-wise time-table'!$G$2","v":3},{"$f":"VLOOKUP(E391,'teacher-wise time-table'!$A$5:$N$106,7)","v":0},{"$f":"VLOOKUP(E391+1,'teacher-wise time-table'!$A$5:$N$106,7)","v":0}]
[{"$f":"'teacher-wise time-table'!$H$3","v":"09:05-09:40"},{"$f":"'teacher-wise time-table'!$H$4","v":"09:25-09:55"},{"$f":"'teacher-wise time-table'!$H$2","v":4},{"$f":"VLOOKUP(E391,'teacher-wise time-table'!$A$5:$N$106,8)","v":0},{"$f":"VLOOKUP(E391+1,'teacher-wise time-table'!$A$5:$N$106,8)","v":0}]
[{"$f":"'teacher-wise time-table'!$I$6","v":"09:40-10:10         "},{"$f":"'teacher-wise time-table'!$I$11","v":"09:55-10:25"},{"$f":"'teacher-wise time-table'!$I$2","v":" BREAK      "}]
[{"$f":"'teacher-wise time-table'!$J$3","v":"10:10-10:45"},{"$f":"'teacher-wise time-table'!$J$4","v":"10:25-10:55"},{"$f":"'teacher-wise time-table'!$J$2","v":5},{"$f":"VLOOKUP(E391,'teacher-wise time-table'!$A$5:$N$106,10)","v":0},{"$f":"VLOOKUP(E391+1,'teacher-wise time-table'!$A$5:$N$106,10)","v":0}]
[{"$f":"'teacher-wise time-table'!$K$3","v":"10:45-11:20"},{"$f":"'teacher-wise time-table'!$K$4","v":"10:55-11:25"},{"$f":"'teacher-wise time-table'!$K$2","v":6},{"$f":"VLOOKUP(E391,'teacher-wise time-table'!$A$5:$N$106,11)","v":0},{"$f":"VLOOKUP(E391+1,'teacher-wise time-table'!$A$5:$N$106,11)","v":0}]
[{"$f":"'teacher-wise time-table'!$L$3","v":"11:20-11:55"},{"$f":"'teacher-wise time-table'!$L$4","v":"11:25-11:55"},{"$f":"'teacher-wise time-table'!$L$2","v":7},{"$f":"VLOOKUP(E391,'teacher-wise time-table'!$A$5:$N$106,12)","v":0},{"$f":"VLOOKUP(E391+1,'teacher-wise time-table'!$A$5:$N$106,12)","v":0}]
[{"$f":"'teacher-wise time-table'!$M$3","v":"11:55-12:25"},{"$f":"'teacher-wise time-table'!$M$4","v":"11:55-12:25"},{"$f":"'teacher-wise time-table'!$M$2","v":8},{"$f":"VLOOKUP(E391,'teacher-wise time-table'!$A$5:$N$106,13)","v":0},{"$f":"VLOOKUP(E391+1,'teacher-wise time-table'!$A$5:$N$106,13)","v":0}]
["SIGN. OF THE PRINCIPAL",null,null,{"$f":"'teacher-wise time-table'!$N$2","v":"TTL PERIODS PER WEEK"},{"$f":"VLOOKUP(E391,'teacher-wise time-table'!$A$5:$N$106,14)","v":21}]
[{"$f":"'teacher-wise time-table'!$B$1","v":"GOVT. GIRLS' HR. SEC. SCHOOL, NIMBAHERA,                                                  TEACHER-WISE TIME TABLE FOR THE YEAR 2014-15"},null,null,null,{"$f":"E391+3","v":82}]
[]
[{"$f":"'teacher-wise time-table'!$D$3","v":"SUMMER TIMINGS"},{"$f":"'teacher-wise time-table'!$D$4","v":"WINTER TIMINGS"},{"$f":"'teacher-wise time-table'!$D$2","v":"PERIOD"},{"$f":"VLOOKUP(E406,'teacher-wise time-table'!$A$5:$N$106,2)","v":0},{"$f":"VLOOKUP(E406,'teacher-wise time-table'!$A$5:$N$106,3)","v":0}]
[]
[{"$f":"'teacher-wise time-table'!$B$3","v":"7:00-7:20"},{"$f":"'teacher-wise time-table'!$B$4","v":"7:30-7:50"},{"$f":"'teacher-wise time-table'!$B$2","v":"PRAYER"},{"$f":"VLOOKUP(E406,'teacher-wise time-table'!$A$5:$N$106,4)","v":0}]
[{"$f":"'teacher-wise time-table'!$E$3","v":"07:20-07:55"},{"$f":"'teacher-wise time-table'!$E$4","v":"07:50-08:25"},{"$f":"'teacher-wise time-table'!$E$2","v":1},{"$f":"VLOOKUP(E406,'teacher-wise time-table'!$A$5:$N$106,5)","v":0},{"$f":"VLOOKUP(E406+1,'teacher-wise time-table'!$A$5:$N$106,5)","v":0}]
[{"$f":"'teacher-wise time-table'!$F$3","v":"07:55-08:30"},{"$f":"'teacher-wise time-table'!$F$4","v":"08:25-08:55"},{"$f":"'teacher-wise time-table'!$F$2","v":2},{"$f":"VLOOKUP(E406,'teacher-wise time-table'!$A$5:$N$106,6)","v":0},{"$f":"VLOOKUP(E406+1,'teacher-wise time-table'!$A$5:$N$106,6)","v":0}]
[{"$f":"'teacher-wise time-table'!$G$3","v":"08:30-09:05"},{"$f":"'teacher-wise time-table'!$G$4","v":"08:55-09:25"},{"$f":"'teacher-wise time-table'!$G$2","v":3},{"$f":"VLOOKUP(E406,'teacher-wise time-table'!$A$5:$N$106,7)","v":0},{"$f":"VLOOKUP(E406+1,'teacher-wise time-table'!$A$5:$N$106,7)","v":0}]
[{"$f":"'teacher-wise time-table'!$H$3","v":"09:05-09:40"},{"$f":"'teacher-wise time-table'!$H$4","v":"09:25-09:55"},{"$f":"'teacher-wise time-table'!$H$2","v":4},{"$f":"VLOOKUP(E406,'teacher-wise time-table'!$A$5:$N$106,8)","v":0},{"$f":"VLOOKUP(E406+1,'teacher-wise time-table'!$A$5:$N$106,8)","v":0}]
[{"$f":"'teacher-wise time-table'!$I$6","v":"09:40-10:10         "},{"$f":"'teacher-wise time-table'!$I$11","v":"09:55-10:25"},{"$f":"'teacher-wise time-table'!$I$2","v":" BREAK      "}]
[{"$f":"'teacher-wise time-table'!$J$3","v":"10:10-10:45"},{"$f":"'teacher-wise time-table'!$J$4","v":"10:25-10:55"},{"$f":"'teacher-wise time-table'!$J$2","v":5},{"$f":"VLOOKUP(E406,'teacher-wise time-table'!$A$5:$N$106,10)","v":0},{"$f":"VLOOKUP(E406+1,'teacher-wise time-table'!$A$5:$N$106,10)","v":0}]
[{"$f":"'teacher-wise time-table'!$K$3","v":"10:45-11:20"},{"$f":"'teacher-wise time-table'!$K$4","v":"10:55-11:25"},{"$f":"'teacher-wise time-table'!$K$2","v":6},{"$f":"VLOOKUP(E406,'teacher-wise time-table'!$A$5:$N$106,11)","v":0},{"$f":"VLOOKUP(E406+1,'teacher-wise time-table'!$A$5:$N$106,11)","v":0}]
[{"$f":"'teacher-wise time-table'!$L$3","v":"11:20-11:55"},{"$f":"'teacher-wise time-table'!$L$4","v":"11:25-11:55"},{"$f":"'teacher-wise time-table'!$L$2","v":7},{"$f":"VLOOKUP(E406,'teacher-wise time-table'!$A$5:$N$106,12)","v":0},{"$f":"VLOOKUP(E406+1,'teacher-wise time-table'!$A$5:$N$106,12)","v":0}]
[{"$f":"'teacher-wise time-table'!$M$3","v":"11:55-12:25"},{"$f":"'teacher-wise time-table'!$M$4","v":"11:55-12:25"},{"$f":"'teacher-wise time-table'!$M$2","v":8},{"$f":"VLOOKUP(E406,'teacher-wise time-table'!$A$5:$N$106,13)","v":0},{"$f":"VLOOKUP(E406+1,'teacher-wise time-table'!$A$5:$N$106,13)","v":0}]
["SIGN. OF THE PRINCIPAL",null,null,{"$f":"'teacher-wise time-table'!$N$2","v":"TTL PERIODS PER WEEK"},{"$f":"VLOOKUP(E406,'teacher-wise time-table'!$A$5:$N$106,14)","v":12}]
[{"$f":"'teacher-wise time-table'!$B$1","v":"GOVT. GIRLS' HR. SEC. SCHOOL, NIMBAHERA,                                                  TEACHER-WISE TIME TABLE FOR THE YEAR 2014-15"},null,null,null,{"$f":"E406+3","v":85}]
[]
[{"$f":"'teacher-wise time-table'!$D$3","v":"SUMMER TIMINGS"},{"$f":"'teacher-wise time-table'!$D$4","v":"WINTER TIMINGS"},{"$f":"'teacher-wise time-table'!$D$2","v":"PERIOD"},{"$f":"VLOOKUP(E421,'teacher-wise time-table'!$A$5:$N$106,2)","v":0},{"$f":"VLOOKUP(E421,'teacher-wise time-table'!$A$5:$N$106,3)","v":0}]
[]
[{"$f":"'teacher-wise time-table'!$B$3","v":"7:00-7:20"},{"$f":"'teacher-wise time-table'!$B$4","v":"7:30-7:50"},{"$f":"'teacher-wise time-table'!$B$2","v":"PRAYER"},{"$f":"VLOOKUP(E421,'teacher-wise time-table'!$A$5:$N$106,4)","v":0}]
[{"$f":"'teacher-wise time-table'!$E$3","v":"07:20-07:55"},{"$f":"'teacher-wise time-table'!$E$4","v":"07:50-08:25"},{"$f":"'teacher-wise time-table'!$E$2","v":1},{"$f":"VLOOKUP(E421,'teacher-wise time-table'!$A$5:$N$106,5)","v":0},{"$f":"VLOOKUP(E421+1,'teacher-wise time-table'!$A$5:$N$106,5)","v":0}]
[{"$f":"'teacher-wise time-table'!$F$3","v":"07:55-08:30"},{"$f":"'teacher-wise time-table'!$F$4","v":"08:25-08:55"},{"$f":"'teacher-wise time-table'!$F$2","v":2},{"$f":"VLOOKUP(E421,'teacher-wise time-table'!$A$5:$N$106,6)","v":0},{"$f":"VLOOKUP(E421+1,'teacher-wise time-table'!$A$5:$N$106,6)","v":0}]
[{"$f":"'teacher-wise time-table'!$G$3","v":"08:30-09:05"},{"$f":"'teacher-wise time-table'!$G$4","v":"08:55-09:25"},{"$f":"'teacher-wise time-table'!$G$2","v":3},{"$f":"VLOOKUP(E421,'teacher-wise time-table'!$A$5:$N$106,7)","v":0},{"$f":"VLOOKUP(E421+1,'teacher-wise time-table'!$A$5:$N$106,7)","v":0}]
[{"$f":"'teacher-wise time-table'!$H$3","v":"09:05-09:40"},{"$f":"'teacher-wise time-table'!$H$4","v":"09:25-09:55"},{"$f":"'teacher-wise time-table'!$H$2","v":4},{"$f":"VLOOKUP(E421,'teacher-wise time-table'!$A$5:$N$106,8)","v":0},{"$f":"VLOOKUP(E421+1,'teacher-wise time-table'!$A$5:$N$106,8)","v":0}]
[{"$f":"'teacher-wise time-table'!$I$6","v":"09:40-10:10         "},{"$f":"'teacher-wise time-table'!$I$11","v":"09:55-10:25"},{"$f":"'teacher-wise time-table'!$I$2","v":" BREAK      "}]
[{"$f":"'teacher-wise time-table'!$J$3","v":"10:10-10:45"},{"$f":"'teacher-wise time-table'!$J$4","v":"10:25-10:55"},{"$f":"'teacher-wise time-table'!$J$2","v":5},{"$f":"VLOOKUP(E421,'teacher-wise time-table'!$A$5:$N$106,10)","v":0},{"$f":"VLOOKUP(E421+1,'teacher-wise time-table'!$A$5:$N$106,10)","v":0}]
[{"$f":"'teacher-wise time-table'!$K$3","v":"10:45-11:20"},{"$f":"'teacher-wise time-table'!$K$4","v":"10:55-11:25"},{"$f":"'teacher-wise time-table'!$K$2","v":6},{"$f":"VLOOKUP(E421,'teacher-wise time-table'!$A$5:$N$106,11)","v":0},{"$f":"VLOOKUP(E421+1,'teacher-wise time-table'!$A$5:$N$106,11)","v":0}]
[{"$f":"'teacher-wise time-table'!$L$3","v":"11:20-11:55"},{"$f":"'teacher-wise time-table'!$L$4","v":"11:25-11:55"},{"$f":"'teacher-wise time-table'!$L$2","v":7},{"$f":"VLOOKUP(E421,'teacher-wise time-table'!$A$5:$N$106,12)","v":0},{"$f":"VLOOKUP(E421+1,'teacher-wise time-table'!$A$5:$N$106,12)","v":0}]
[{"$f":"'teacher-wise time-table'!$M$3","v":"11:55-12:25"},{"$f":"'teacher-wise time-table'!$M$4","v":"11:55-12:25"},{"$f":"'teacher-wise time-table'!$M$2","v":8},{"$f":"VLOOKUP(E421,'teacher-wise time-table'!$A$5:$N$106,13)","v":0},{"$f":"VLOOKUP(E421+1,'teacher-wise time-table'!$A$5:$N$106,13)","v":0}]
["SIGN. OF THE PRINCIPAL",null,null,{"$f":"'teacher-wise time-table'!$N$2","v":"TTL PERIODS PER WEEK"},{"$f":"VLOOKUP(E421,'teacher-wise time-table'!$A$5:$N$106,14)","v":19}]
[{"$f":"'teacher-wise time-table'!$B$1","v":"GOVT. GIRLS' HR. SEC. SCHOOL, NIMBAHERA,                                                  TEACHER-WISE TIME TABLE FOR THE YEAR 2014-15"},null,null,null,{"$f":"E421+3","v":88}]
[]
[{"$f":"'teacher-wise time-table'!$D$3","v":"SUMMER TIMINGS"},{"$f":"'teacher-wise time-table'!$D$4","v":"WINTER TIMINGS"},{"$f":"'teacher-wise time-table'!$D$2","v":"PERIOD"},{"$f":"VLOOKUP(E436,'teacher-wise time-table'!$A$5:$N$106,2)","v":0},{"$f":"VLOOKUP(E436,'teacher-wise time-table'!$A$5:$N$106,3)","v":0}]
[]
[{"$f":"'teacher-wise time-table'!$B$3","v":"7:00-7:20"},{"$f":"'teacher-wise time-table'!$B$4","v":"7:30-7:50"},{"$f":"'teacher-wise time-table'!$B$2","v":"PRAYER"},{"$f":"VLOOKUP(E436,'teacher-wise time-table'!$A$5:$N$106,4)","v":0}]
[{"$f":"'teacher-wise time-table'!$E$3","v":"07:20-07:55"},{"$f":"'teacher-wise time-table'!$E$4","v":"07:50-08:25"},{"$f":"'teacher-wise time-table'!$E$2","v":1},{"$f":"VLOOKUP(E436,'teacher-wise time-table'!$A$5:$N$106,5)","v":0},{"$f":"VLOOKUP(E436+1,'teacher-wise time-table'!$A$5:$N$106,5)","v":0}]
[{"$f":"'teacher-wise time-table'!$F$3","v":"07:55-08:30"},{"$f":"'teacher-wise time-table'!$F$4","v":"08:25-08:55"},{"$f":"'teacher-wise time-table'!$F$2","v":2},{"$f":"VLOOKUP(E436,'teacher-wise time-table'!$A$5:$N$106,6)","v":0},{"$f":"VLOOKUP(E436+1,'teacher-wise time-table'!$A$5:$N$106,6)","v":0}]
[{"$f":"'teacher-wise time-table'!$G$3","v":"08:30-09:05"},{"$f":"'teacher-wise time-table'!$G$4","v":"08:55-09:25"},{"$f":"'teacher-wise time-table'!$G$2","v":3},{"$f":"VLOOKUP(E436,'teacher-wise time-table'!$A$5:$N$106,7)","v":0},{"$f":"VLOOKUP(E436+1,'teacher-wise time-table'!$A$5:$N$106,7)","v":0}]
[{"$f":"'teacher-wise time-table'!$H$3","v":"09:05-09:40"},{"$f":"'teacher-wise time-table'!$H$4","v":"09:25-09:55"},{"$f":"'teacher-wise time-table'!$H$2","v":4},{"$f":"VLOOKUP(E436,'teacher-wise time-table'!$A$5:$N$106,8)","v":0},{"$f":"VLOOKUP(E436+1,'teacher-wise time-table'!$A$5:$N$106,8)","v":0}]
[{"$f":"'teacher-wise time-table'!$I$6","v":"09:40-10:10         "},{"$f":"'teacher-wise time-table'!$I$11","v":"09:55-10:25"},{"$f":"'teacher-wise time-table'!$I$2","v":" BREAK      "}]
[{"$f":"'teacher-wise time-table'!$J$3","v":"10:10-10:45"},{"$f":"'teacher-wise time-table'!$J$4","v":"10:25-10:55"},{"$f":"'teacher-wise time-table'!$J$2","v":5},{"$f":"VLOOKUP(E436,'teacher-wise time-table'!$A$5:$N$106,10)","v":0},{"$f":"VLOOKUP(E436+1,'teacher-wise time-table'!$A$5:$N$106,10)","v":0}]
[{"$f":"'teacher-wise time-table'!$K$3","v":"10:45-11:20"},{"$f":"'teacher-wise time-table'!$K$4","v":"10:55-11:25"},{"$f":"'teacher-wise time-table'!$K$2","v":6},{"$f":"VLOOKUP(E436,'teacher-wise time-table'!$A$5:$N$106,11)","v":0},{"$f":"VLOOKUP(E436+1,'teacher-wise time-table'!$A$5:$N$106,11)","v":0}]
[{"$f":"'teacher-wise time-table'!$L$3","v":"11:20-11:55"},{"$f":"'teacher-wise time-table'!$L$4","v":"11:25-11:55"},{"$f":"'teacher-wise time-table'!$L$2","v":7},{"$f":"VLOOKUP(E436,'teacher-wise time-table'!$A$5:$N$106,12)","v":0},{"$f":"VLOOKUP(E436+1,'teacher-wise time-table'!$A$5:$N$106,12)","v":0}]
[{"$f":"'teacher-wise time-table'!$M$3","v":"11:55-12:25"},{"$f":"'teacher-wise time-table'!$M$4","v":"11:55-12:25"},{"$f":"'teacher-wise time-table'!$M$2","v":8},{"$f":"VLOOKUP(E436,'teacher-wise time-table'!$A$5:$N$106,13)","v":0},{"$f":"VLOOKUP(E436+1,'teacher-wise time-table'!$A$5:$N$106,13)","v":0}]
["SIGN. OF THE PRINCIPAL",null,null,{"$f":"'teacher-wise time-table'!$N$2","v":"TTL PERIODS PER WEEK"},{"$f":"VLOOKUP(E436,'teacher-wise time-table'!$A$5:$N$106,14)","v":19}]
[{"$f":"'teacher-wise time-table'!$B$1","v":"GOVT. GIRLS' HR. SEC. SCHOOL, NIMBAHERA,                                                  TEACHER-WISE TIME TABLE FOR THE YEAR 2014-15"},null,null,null,{"$f":"E436+3","v":91}]
[]
[{"$f":"'teacher-wise time-table'!$D$3","v":"SUMMER TIMINGS"},{"$f":"'teacher-wise time-table'!$D$4","v":"WINTER TIMINGS"},{"$f":"'teacher-wise time-table'!$D$2","v":"PERIOD"},{"$f":"VLOOKUP(E451,'teacher-wise time-table'!$A$5:$N$106,2)","v":0},{"$f":"VLOOKUP(E451,'teacher-wise time-table'!$A$5:$N$106,3)","v":0}]
[]
[{"$f":"'teacher-wise time-table'!$B$3","v":"7:00-7:20"},{"$f":"'teacher-wise time-table'!$B$4","v":"7:30-7:50"},{"$f":"'teacher-wise time-table'!$B$2","v":"PRAYER"},{"$f":"VLOOKUP(E451,'teacher-wise time-table'!$A$5:$N$106,4)","v":0}]
[{"$f":"'teacher-wise time-table'!$E$3","v":"07:20-07:55"},{"$f":"'teacher-wise time-table'!$E$4","v":"07:50-08:25"},{"$f":"'teacher-wise time-table'!$E$2","v":1},{"$f":"VLOOKUP(E451,'teacher-wise time-table'!$A$5:$N$106,5)","v":0},{"$f":"VLOOKUP(E451+1,'teacher-wise time-table'!$A$5:$N$106,5)","v":0}]
[{"$f":"'teacher-wise time-table'!$F$3","v":"07:55-08:30"},{"$f":"'teacher-wise time-table'!$F$4","v":"08:25-08:55"},{"$f":"'teacher-wise time-table'!$F$2","v":2},{"$f":"VLOOKUP(E451,'teacher-wise time-table'!$A$5:$N$106,6)","v":0},{"$f":"VLOOKUP(E451+1,'teacher-wise time-table'!$A$5:$N$106,6)","v":0}]
[{"$f":"'teacher-wise time-table'!$G$3","v":"08:30-09:05"},{"$f":"'teacher-wise time-table'!$G$4","v":"08:55-09:25"},{"$f":"'teacher-wise time-table'!$G$2","v":3},{"$f":"VLOOKUP(E451,'teacher-wise time-table'!$A$5:$N$106,7)","v":0},{"$f":"VLOOKUP(E451+1,'teacher-wise time-table'!$A$5:$N$106,7)","v":0}]
[{"$f":"'teacher-wise time-table'!$H$3","v":"09:05-09:40"},{"$f":"'teacher-wise time-table'!$H$4","v":"09:25-09:55"},{"$f":"'teacher-wise time-table'!$H$2","v":4},{"$f":"VLOOKUP(E451,'teacher-wise time-table'!$A$5:$N$106,8)","v":0},{"$f":"VLOOKUP(E451+1,'teacher-wise time-table'!$A$5:$N$106,8)","v":0}]
[{"$f":"'teacher-wise time-table'!$I$6","v":"09:40-10:10         "},{"$f":"'teacher-wise time-table'!$I$11","v":"09:55-10:25"},{"$f":"'teacher-wise time-table'!$I$2","v":" BREAK      "}]
[{"$f":"'teacher-wise time-table'!$J$3","v":"10:10-10:45"},{"$f":"'teacher-wise time-table'!$J$4","v":"10:25-10:55"},{"$f":"'teacher-wise time-table'!$J$2","v":5},{"$f":"VLOOKUP(E451,'teacher-wise time-table'!$A$5:$N$106,10)","v":0},{"$f":"VLOOKUP(E451+1,'teacher-wise time-table'!$A$5:$N$106,10)","v":0}]
[{"$f":"'teacher-wise time-table'!$K$3","v":"10:45-11:20"},{"$f":"'teacher-wise time-table'!$K$4","v":"10:55-11:25"},{"$f":"'teacher-wise time-table'!$K$2","v":6},{"$f":"VLOOKUP(E451,'teacher-wise time-table'!$A$5:$N$106,11)","v":0},{"$f":"VLOOKUP(E451+1,'teacher-wise time-table'!$A$5:$N$106,11)","v":0}]
[{"$f":"'teacher-wise time-table'!$L$3","v":"11:20-11:55"},{"$f":"'teacher-wise time-table'!$L$4","v":"11:25-11:55"},{"$f":"'teacher-wise time-table'!$L$2","v":7},{"$f":"VLOOKUP(E451,'teacher-wise time-table'!$A$5:$N$106,12)","v":0},{"$f":"VLOOKUP(E451+1,'teacher-wise time-table'!$A$5:$N$106,12)","v":0}]
[{"$f":"'teacher-wise time-table'!$M$3","v":"11:55-12:25"},{"$f":"'teacher-wise time-table'!$M$4","v":"11:55-12:25"},{"$f":"'teacher-wise time-table'!$M$2","v":8},{"$f":"VLOOKUP(E451,'teacher-wise time-table'!$A$5:$N$106,13)","v":0},{"$f":"VLOOKUP(E451+1,'teacher-wise time-table'!$A$5:$N$106,13)","v":0}]
["SIGN. OF THE PRINCIPAL",null,null,{"$f":"'teacher-wise time-table'!$N$2","v":"TTL PERIODS PER WEEK"},{"$f":"VLOOKUP(E451,'teacher-wise time-table'!$A$5:$N$106,14)","v":"22+2"}]
[{"$f":"'teacher-wise time-table'!$B$1","v":"GOVT. GIRLS' HR. SEC. SCHOOL, NIMBAHERA,                                                  TEACHER-WISE TIME TABLE FOR THE YEAR 2014-15"},null,null,null,{"$f":"E451+3","v":94}]
[]
[{"$f":"'teacher-wise time-table'!$D$3","v":"SUMMER TIMINGS"},{"$f":"'teacher-wise time-table'!$D$4","v":"WINTER TIMINGS"},{"$f":"'teacher-wise time-table'!$D$2","v":"PERIOD"},{"$f":"VLOOKUP(E466,'teacher-wise time-table'!$A$5:$N$106,2)","v":0},{"$f":"VLOOKUP(E466,'teacher-wise time-table'!$A$5:$N$106,3)","v":0}]
[]
[{"$f":"'teacher-wise time-table'!$B$3","v":"7:00-7:20"},{"$f":"'teacher-wise time-table'!$B$4","v":"7:30-7:50"},{"$f":"'teacher-wise time-table'!$B$2","v":"PRAYER"},{"$f":"VLOOKUP(E466,'teacher-wise time-table'!$A$5:$N$106,4)","v":0}]
[{"$f":"'teacher-wise time-table'!$E$3","v":"07:20-07:55"},{"$f":"'teacher-wise time-table'!$E$4","v":"07:50-08:25"},{"$f":"'teacher-wise time-table'!$E$2","v":1},{"$f":"VLOOKUP(E466,'teacher-wise time-table'!$A$5:$N$106,5)","v":0},{"$f":"VLOOKUP(E466+1,'teacher-wise time-table'!$A$5:$N$106,5)","v":0}]
[{"$f":"'teacher-wise time-table'!$F$3","v":"07:55-08:30"},{"$f":"'teacher-wise time-table'!$F$4","v":"08:25-08:55"},{"$f":"'teacher-wise time-table'!$F$2","v":2},{"$f":"VLOOKUP(E466,'teacher-wise time-table'!$A$5:$N$106,6)","v":0},{"$f":"VLOOKUP(E466+1,'teacher-wise time-table'!$A$5:$N$106,6)","v":0}]
[{"$f":"'teacher-wise time-table'!$G$3","v":"08:30-09:05"},{"$f":"'teacher-wise time-table'!$G$4","v":"08:55-09:25"},{"$f":"'teacher-wise time-table'!$G$2","v":3},{"$f":"VLOOKUP(E466,'teacher-wise time-table'!$A$5:$N$106,7)","v":0},{"$f":"VLOOKUP(E466+1,'teacher-wise time-table'!$A$5:$N$106,7)","v":0}]
[{"$f":"'teacher-wise time-table'!$H$3","v":"09:05-09:40"},{"$f":"'teacher-wise time-table'!$H$4","v":"09:25-09:55"},{"$f":"'teacher-wise time-table'!$H$2","v":4},{"$f":"VLOOKUP(E466,'teacher-wise time-table'!$A$5:$N$106,8)","v":0},{"$f":"VLOOKUP(E466+1,'teacher-wise time-table'!$A$5:$N$106,8)","v":0}]
[{"$f":"'teacher-wise time-table'!$I$6","v":"09:40-10:10         "},{"$f":"'teacher-wise time-table'!$I$11","v":"09:55-10:25"},{"$f":"'teacher-wise time-table'!$I$2","v":" BREAK      "}]
[{"$f":"'teacher-wise time-table'!$J$3","v":"10:10-10:45"},{"$f":"'teacher-wise time-table'!$J$4","v":"10:25-10:55"},{"$f":"'teacher-wise time-table'!$J$2","v":5},{"$f":"VLOOKUP(E466,'teacher-wise time-table'!$A$5:$N$106,10)","v":0},{"$f":"VLOOKUP(E466+1,'teacher-wise time-table'!$A$5:$N$106,10)","v":0}]
[{"$f":"'teacher-wise time-table'!$K$3","v":"10:45-11:20"},{"$f":"'teacher-wise time-table'!$K$4","v":"10:55-11:25"},{"$f":"'teacher-wise time-table'!$K$2","v":6},{"$f":"VLOOKUP(E466,'teacher-wise time-table'!$A$5:$N$106,11)","v":0},{"$f":"VLOOKUP(E466+1,'teacher-wise time-table'!$A$5:$N$106,11)","v":0}]
[{"$f":"'teacher-wise time-table'!$L$3","v":"11:20-11:55"},{"$f":"'teacher-wise time-table'!$L$4","v":"11:25-11:55"},{"$f":"'teacher-wise time-table'!$L$2","v":7},{"$f":"VLOOKUP(E466,'teacher-wise time-table'!$A$5:$N$106,12)","v":0},{"$f":"VLOOKUP(E466+1,'teacher-wise time-table'!$A$5:$N$106,12)","v":0}]
[{"$f":"'teacher-wise time-table'!$M$3","v":"11:55-12:25"},{"$f":"'teacher-wise time-table'!$M$4","v":"11:55-12:25"},{"$f":"'teacher-wise time-table'!$M$2","v":8},{"$f":"VLOOKUP(E466,'teacher-wise time-table'!$A$5:$N$106,13)","v":0},{"$f":"VLOOKUP(E466+1,'teacher-wise time-table'!$A$5:$N$106,13)","v":0}]
["SIGN. OF THE PRINCIPAL",null,null,{"$f":"'teacher-wise time-table'!$N$2","v":"TTL PERIODS PER WEEK"},{"$f":"VLOOKUP(E466,'teacher-wise time-table'!$A$5:$N$106,14)","v":19}]
[{"$f":"'teacher-wise time-table'!$B$1","v":"GOVT. GIRLS' HR. SEC. SCHOOL, NIMBAHERA,                                                  TEACHER-WISE TIME TABLE FOR THE YEAR 2014-15"},null,null,null,{"$f":"E466+3","v":97}]
[]
[{"$f":"'teacher-wise time-table'!$D$3","v":"SUMMER TIMINGS"},{"$f":"'teacher-wise time-table'!$D$4","v":"WINTER TIMINGS"},{"$f":"'teacher-wise time-table'!$D$2","v":"PERIOD"},{"$f":"VLOOKUP(E481,'teacher-wise time-table'!$A$5:$N$106,2)","v":0},{"$f":"VLOOKUP(E481,'teacher-wise time-table'!$A$5:$N$106,3)","v":0}]
[]
[{"$f":"'teacher-wise time-table'!$B$3","v":"7:00-7:20"},{"$f":"'teacher-wise time-table'!$B$4","v":"7:30-7:50"},{"$f":"'teacher-wise time-table'!$B$2","v":"PRAYER"},{"$f":"VLOOKUP(E481,'teacher-wise time-table'!$A$5:$N$106,4)","v":0}]
[{"$f":"'teacher-wise time-table'!$E$3","v":"07:20-07:55"},{"$f":"'teacher-wise time-table'!$E$4","v":"07:50-08:25"},{"$f":"'teacher-wise time-table'!$E$2","v":1},{"$f":"VLOOKUP(E481,'teacher-wise time-table'!$A$5:$N$106,5)","v":0},{"$f":"VLOOKUP(E481+1,'teacher-wise time-table'!$A$5:$N$106,5)","v":0}]
[{"$f":"'teacher-wise time-table'!$F$3","v":"07:55-08:30"},{"$f":"'teacher-wise time-table'!$F$4","v":"08:25-08:55"},{"$f":"'teacher-wise time-table'!$F$2","v":2},{"$f":"VLOOKUP(E481,'teacher-wise time-table'!$A$5:$N$106,6)","v":0},{"$f":"VLOOKUP(E481+1,'teacher-wise time-table'!$A$5:$N$106,6)","v":0}]
[{"$f":"'teacher-wise time-table'!$G$3","v":"08:30-09:05"},{"$f":"'teacher-wise time-table'!$G$4","v":"08:55-09:25"},{"$f":"'teacher-wise time-table'!$G$2","v":3},{"$f":"VLOOKUP(E481,'teacher-wise time-table'!$A$5:$N$106,7)","v":0},{"$f":"VLOOKUP(E481+1,'teacher-wise time-table'!$A$5:$N$106,7)","v":0}]
[{"$f":"'teacher-wise time-table'!$H$3","v":"09:05-09:40"},{"$f":"'teacher-wise time-table'!$H$4","v":"09:25-09:55"},{"$f":"'teacher-wise time-table'!$H$2","v":4},{"$f":"VLOOKUP(E481,'teacher-wise time-table'!$A$5:$N$106,8)","v":0},{"$f":"VLOOKUP(E481+1,'teacher-wise time-table'!$A$5:$N$106,8)","v":0}]
[{"$f":"'teacher-wise time-table'!$I$6","v":"09:40-10:10         "},{"$f":"'teacher-wise time-table'!$I$11","v":"09:55-10:25"},{"$f":"'teacher-wise time-table'!$I$2","v":" BREAK      "}]
[{"$f":"'teacher-wise time-table'!$J$3","v":"10:10-10:45"},{"$f":"'teacher-wise time-table'!$J$4","v":"10:25-10:55"},{"$f":"'teacher-wise time-table'!$J$2","v":5},{"$f":"VLOOKUP(E481,'teacher-wise time-table'!$A$5:$N$106,10)","v":0},{"$f":"VLOOKUP(E481+1,'teacher-wise time-table'!$A$5:$N$106,10)","v":0}]
[{"$f":"'teacher-wise time-table'!$K$3","v":"10:45-11:20"},{"$f":"'teacher-wise time-table'!$K$4","v":"10:55-11:25"},{"$f":"'teacher-wise time-table'!$K$2","v":6},{"$f":"VLOOKUP(E481,'teacher-wise time-table'!$A$5:$N$106,11)","v":0},{"$f":"VLOOKUP(E481+1,'teacher-wise time-table'!$A$5:$N$106,11)","v":0}]
[{"$f":"'teacher-wise time-table'!$L$3","v":"11:20-11:55"},{"$f":"'teacher-wise time-table'!$L$4","v":"11:25-11:55"},{"$f":"'teacher-wise time-table'!$L$2","v":7},{"$f":"VLOOKUP(E481,'teacher-wise time-table'!$A$5:$N$106,12)","v":0},{"$f":"VLOOKUP(E481+1,'teacher-wise time-table'!$A$5:$N$106,12)","v":0}]
[{"$f":"'teacher-wise time-table'!$M$3","v":"11:55-12:25"},{"$f":"'teacher-wise time-table'!$M$4","v":"11:55-12:25"},{"$f":"'teacher-wise time-table'!$M$2","v":8},{"$f":"VLOOKUP(E481,'teacher-wise time-table'!$A$5:$N$106,13)","v":0},{"$f":"VLOOKUP(E481+1,'teacher-wise time-table'!$A$5:$N$106,13)","v":0}]
["SIGN. OF THE PRINCIPAL",null,null,{"$f":"'teacher-wise time-table'!$N$2","v":"TTL PERIODS PER WEEK"},{"$f":"VLOOKUP(E481,'teacher-wise time-table'!$A$5:$N$106,14)","v":19}]
[{"$f":"'teacher-wise time-table'!$B$1","v":"GOVT. GIRLS' HR. SEC. SCHOOL, NIMBAHERA,                                                  TEACHER-WISE TIME TABLE FOR THE YEAR 2014-15"},null,null,null,{"$f":"E481+3","v":100}]
[]
[{"$f":"'teacher-wise time-table'!$D$3","v":"SUMMER TIMINGS"},{"$f":"'teacher-wise time-table'!$D$4","v":"WINTER TIMINGS"},{"$f":"'teacher-wise time-table'!$D$2","v":"PERIOD"},{"$f":"VLOOKUP(E496,'teacher-wise time-table'!$A$5:$N$106,2)","v":0},{"$f":"VLOOKUP(E496,'teacher-wise time-table'!$A$5:$N$106,3)","v":0}]
[]
[{"$f":"'teacher-wise time-table'!$B$3","v":"7:00-7:20"},{"$f":"'teacher-wise time-table'!$B$4","v":"7:30-7:50"},{"$f":"'teacher-wise time-table'!$B$2","v":"PRAYER"},{"$f":"VLOOKUP(E496,'teacher-wise time-table'!$A$5:$N$106,4)","v":0}]
[{"$f":"'teacher-wise time-table'!$E$3","v":"07:20-07:55"},{"$f":"'teacher-wise time-table'!$E$4","v":"07:50-08:25"},{"$f":"'teacher-wise time-table'!$E$2","v":1},{"$f":"VLOOKUP(E496,'teacher-wise time-table'!$A$5:$N$106,5)","v":0},{"$f":"VLOOKUP(E496+1,'teacher-wise time-table'!$A$5:$N$106,5)","v":0}]
[{"$f":"'teacher-wise time-table'!$F$3","v":"07:55-08:30"},{"$f":"'teacher-wise time-table'!$F$4","v":"08:25-08:55"},{"$f":"'teacher-wise time-table'!$F$2","v":2},{"$f":"VLOOKUP(E496,'teacher-wise time-table'!$A$5:$N$106,6)","v":0},{"$f":"VLOOKUP(E496+1,'teacher-wise time-table'!$A$5:$N$106,6)","v":0}]
[{"$f":"'teacher-wise time-table'!$G$3","v":"08:30-09:05"},{"$f":"'teacher-wise time-table'!$G$4","v":"08:55-09:25"},{"$f":"'teacher-wise time-table'!$G$2","v":3},{"$f":"VLOOKUP(E496,'teacher-wise time-table'!$A$5:$N$106,7)","v":0},{"$f":"VLOOKUP(E496+1,'teacher-wise time-table'!$A$5:$N$106,7)","v":0}]
[{"$f":"'teacher-wise time-table'!$H$3","v":"09:05-09:40"},{"$f":"'teacher-wise time-table'!$H$4","v":"09:25-09:55"},{"$f":"'teacher-wise time-table'!$H$2","v":4},{"$f":"VLOOKUP(E496,'teacher-wise time-table'!$A$5:$N$106,8)","v":0},{"$f":"VLOOKUP(E496+1,'teacher-wise time-table'!$A$5:$N$106,8)","v":0}]
[{"$f":"'teacher-wise time-table'!$I$6","v":"09:40-10:10         "},{"$f":"'teacher-wise time-table'!$I$11","v":"09:55-10:25"},{"$f":"'teacher-wise time-table'!$I$2","v":" BREAK      "}]
[{"$f":"'teacher-wise time-table'!$J$3","v":"10:10-10:45"},{"$f":"'teacher-wise time-table'!$J$4","v":"10:25-10:55"},{"$f":"'teacher-wise time-table'!$J$2","v":5},{"$f":"VLOOKUP(E496,'teacher-wise time-table'!$A$5:$N$106,10)","v":0},{"$f":"VLOOKUP(E496+1,'teacher-wise time-table'!$A$5:$N$106,10)","v":0}]
[{"$f":"'teacher-wise time-table'!$K$3","v":"10:45-11:20"},{"$f":"'teacher-wise time-table'!$K$4","v":"10:55-11:25"},{"$f":"'teacher-wise time-table'!$K$2","v":6},{"$f":"VLOOKUP(E496,'teacher-wise time-table'!$A$5:$N$106,11)","v":0},{"$f":"VLOOKUP(E496+1,'teacher-wise time-table'!$A$5:$N$106,11)","v":0}]
[{"$f":"'teacher-wise time-table'!$L$3","v":"11:20-11:55"},{"$f":"'teacher-wise time-table'!$L$4","v":"11:25-11:55"},{"$f":"'teacher-wise time-table'!$L$2","v":7},{"$f":"VLOOKUP(E496,'teacher-wise time-table'!$A$5:$N$106,12)","v":0},{"$f":"VLOOKUP(E496+1,'teacher-wise time-table'!$A$5:$N$106,12)","v":0}]
[{"$f":"'teacher-wise time-table'!$M$3","v":"11:55-12:25"},{"$f":"'teacher-wise time-table'!$M$4","v":"11:55-12:25"},{"$f":"'teacher-wise time-table'!$M$2","v":8},{"$f":"VLOOKUP(E496,'teacher-wise time-table'!$A$5:$N$106,13)","v":0},{"$f":"VLOOKUP(E496+1,'teacher-wise time-table'!$A$5:$N$106,13)","v":0}]
["SIGN. OF THE PRINCIPAL",null,null,{"$f":"'teacher-wise time-table'!$N$2","v":"TTL PERIODS PER WEEK"},{"$f":"VLOOKUP(E496,'teacher-wise time-table'!$A$5:$N$106,14)","v":"22+2"}]

{"sheet":"class-wise time table","index":3,"n_rows":106,"n_cols":13,"rows_kept":106,"cut":false,"hidden":false,"merged":[[0,0,2,0],[0,6,0,12],[0,4,0,5]]}
[null,{"$f":"'teacher-wise time-table'!B1","v":"GOVT. GIRLS' HR. SEC. SCHOOL, NIMBAHERA,                                                  TEACHER-WISE TIME TABLE FOR THE YEAR 2014-15"},null,null,null,null,{"$f":"'teacher-wise time-table'!B1","v":"GOVT. GIRLS' HR. SEC. SCHOOL, NIMBAHERA,                                                  TEACHER-WISE TIME TABLE FOR THE YEAR 2014-15"}]
[null,{"$f":"'teacher-wise time-table'!B3","v":"7:00-7:20"},{"$f":"'teacher-wise time-table'!C3","v":0},{"$f":"'teacher-wise time-table'!D3","v":"SUMMER TIMINGS"},{"$f":"'teacher-wise time-table'!E3","v":"07:20-07:55"},{"$f":"'teacher-wise time-table'!F3","v":"07:55-08:30"},{"$f":"'teacher-wise time-table'!G3","v":"08:30-09:05"},{"$f":"'teacher-wise time-table'!H3","v":"09:05-09:40"},{"$f":"'teacher-wise time-table'!I6","v":"09:40-10:10         "},{"$f":"'teacher-wise time-table'!J3","v":"10:10-10:45"},{"$f":"'teacher-wise time-table'!K3","v":"10:45-11:20"},{"$f":"'teacher-wise time-table'!L3","v":"11:20-11:55"},{"$f":"'teacher-wise time-table'!M3","v":"11:55-12:25"}]
[null,{"$f":"'teacher-wise time-table'!B4","v":"7:30-7:50"},{"$f":"'teacher-wise time-table'!C4","v":0},{"$f":"'teacher-wise time-table'!D4","v":"WINTER TIMINGS"},{"$f":"'teacher-wise time-table'!E4","v":"07:50-08:25"},{"$f":"'teacher-wise time-table'!F4","v":"08:25-08:55"},{"$f":"'teacher-wise time-table'!G4","v":"08:55-09:25"},{"$f":"'teacher-wise time-table'!H4","v":"09:25-09:55"},{"$f":"'teacher-wise time-table'!I11","v":"09:55-10:25"},{"$f":"'teacher-wise time-table'!J4","v":"10:25-10:55"},{"$f":"'teacher-wise time-table'!K4","v":"10:55-11:25"},{"$f":"'teacher-wise time-table'!L4","v":"11:25-11:55"},{"$f":"'teacher-wise time-table'!M4","v":"11:55-12:25"}]
[null,{"$f":"'teacher-wise time-table'!B2","v":"PRAYER"},{"$f":"'teacher-wise time-table'!C2","v":"POST + RESPONSI-BILITIES"},{"$f":"'teacher-wise time-table'!D2","v":"PERIOD"},{"$f":"'teacher-wise time-table'!E2","v":1},{"$f":"'teacher-wise time-table'!F2","v":2},{"$f":"'teacher-wise time-table'!G2","v":3},{"$f":"'teacher-wise time-table'!H2","v":4},{"$f":"'teacher-wise time-table'!I2","v":" BREAK      "},{"$f":"'teacher-wise time-table'!J2","v":5},{"$f":"'teacher-wise time-table'!K2","v":6},{"$f":"'teacher-wise time-table'!L2","v":7},{"$f":"'teacher-wise time-table'!M2","v":8}]
[{"$f":"'teacher-wise time-table'!A5","v":1},{"$f":"IF('teacher-wise time-table'!B5=\"\",\"\",CONCATENATE('teacher-wise time-table'!B5,\", \",'teacher-wise time-table'!B6,\", \",'teacher-wise time-table'!B7))","v":"MR. A, LECTURER, BIOLOGY "},{"$f":"IF('teacher-wise time-table'!C5=\"\",\"\",CONCATENATE('teacher-wise time-table'!C5,\", \",'teacher-wise time-table'!C6,\", \",'teacher-wise time-table'!C7))","v":"LECTURER, BIOLOGY , , "},{"$f":"IF('teacher-wise time-table'!D5=\"\",\"\",CONCATENATE('teacher-wise time-table'!D5,\", \",'teacher-wise time-table'!D6,\", \",'teacher-wise time-table'!D7))","v":"OFFICIATING OFFICER, , "},{"$f":"IF('teacher-wise time-table'!E23=\"\",\"\",CONCATENATE('teacher-wise time-table'!E23,\", \",'teacher-wise time-table'!E24,\", \",'teacher-wise time-table'!E25))","v":"12th E+A,  HINDI COM. 1 TO 6, MR. F"},{"$f":"IF('teacher-wise time-table'!F41=\"\",\"\",CONCATENATE('teacher-wise time-table'!F41,\", \",'teacher-wise time-table'!F42,\", \",'teacher-wise time-table'!F43))","v":"12th E, GEOGRAPHY 1 to 6, VACANT POST 2"},{"$f":"IF('teacher-wise time-table'!G23=\"\",\"\",CONCATENATE('teacher-wise time-table'!G23,\", \",'teacher-wise time-table'!G24,\", \",'teacher-wise time-table'!G25))","v":"12th E, HINDI LIT. 1 TO 6, MR. F"},{"$f":"IF('teacher-wise time-table'!H35=\"\",\"\",CONCATENATE('teacher-wise time-table'!H35,\", \",'teacher-wise time-table'!H36,\", \",'teacher-wise time-table'!H37))","v":"12th E, HOME SC. 1 TO 6, MR. J"},null,{"$f":"IF('teacher-wise time-table'!J14=\"\",\"\",CONCATENATE('teacher-wise time-table'!J14,\", \",'teacher-wise time-table'!J15,\", \",'teacher-wise time-table'!J16))","v":"12th E , ENGLISH 1 TO 6, MR. C"},{"$f":"IF('teacher-wise time-table'!K41=\"\",\"\",CONCATENATE('teacher-wise time-table'!K41,\", \",'teacher-wise time-table'!K42,\", \",'teacher-wise time-table'!K43))","v":"12th E , GEOGRAPHY 1, 3 TO 6, VACANT POST 2"},{"$f":"IF('teacher-wise time-table'!L35=\"\",\"\",CONCATENATE('teacher-wise time-table'!L35,\", \",'teacher-wise time-table'!L36,\", \",'teacher-wise time-table'!L37))","v":"12th E+A , HOME  SC.1,2,4-6 , MR. J"},{"$f":"IF('teacher-wise time-table'!M20=\"\",\"\",CONCATENATE('teacher-wise time-table'!M20,\", \",'teacher-wise time-table'!M21,\", \",'teacher-wise time-table'!M22))","v":"12th E+A, HINDI LIT.1-3,5,6, MR. E"}]
[{"$f":"'teacher-wise time-table'!A6","v":2},null,null,null,{"$f":"IF('teacher-wise time-table'!E8=\"\",\"\",CONCATENATE('teacher-wise time-table'!E8,\", \",'teacher-wise time-table'!E9,\", \",'teacher-wise time-table'!E10))","v":"12th D, CHEMISTRY 1 TO 6, MR. B"},{"$f":"IF('teacher-wise time-table'!F11=\"\",\"\",CONCATENATE('teacher-wise time-table'!F11,\", \",'teacher-wise time-table'!F12,\", \",'teacher-wise time-table'!F13))","v":"12th D, PHYSICS 1 TO 6, VACANT POST 1"},{"$f":"IF('teacher-wise time-table'!G5=\"\",\"\",CONCATENATE('teacher-wise time-table'!G5,\", \",'teacher-wise time-table'!G6,\", \",'teacher-wise time-table'!G7))","v":"12th D , BIOLOGY 1 TO 6, MR. A"},{"$f":"IF('teacher-wise time-table'!H8=\"\",\"\",CONCATENATE('teacher-wise time-table'!H8,\", \",'teacher-wise time-table'!H9,\", \",'teacher-wise time-table'!H10))","v":"12th D , RAJ STD. 1-3 CH 4, MR. B"},null,{"$f":"IF('teacher-wise time-table'!J11=\"\",\"\",CONCATENATE('teacher-wise time-table'!J11,\", \",'teacher-wise time-table'!J12,\", \",'teacher-wise time-table'!J13))","v":"12th D PHY. PR.,  D1 5,6  D2 1,2, VACANT POST 1"},{"$f":"IF('teacher-wise time-table'!K11=\"\",\"\",CONCATENATE('teacher-wise time-table'!K11,\", \",'teacher-wise time-table'!K12,\", \",'teacher-wise time-table'!K13))","v":"12th D PHY. PR.,  D1 5,6  D2 1,2, VACANT POST 1"},{"$f":"IF('teacher-wise time-table'!L14=\"\",\"\",CONCATENATE('teacher-wise time-table'!L14,\", \",'teacher-wise time-table'!L15,\", \",'teacher-wise time-table'!L16))","v":"12th D , ENGLISH 1 TO 6, MR. C"},{"$f":"IF('teacher-wise time-table'!M23=\"\",\"\",CONCATENATE('teacher-wise time-table'!M23,\", \",'teacher-wise time-table'!M24,\", \",'teacher-wise time-table'!M25))","v":"12th D,  HINDI 1 TO 6, MR. F"}]
[{"$f":"'teacher-wise time-table'!A7","v":3},null,null,null,{"$f":"IF('teacher-wise time-table'!E14=\"\",\"\",CONCATENATE('teacher-wise time-table'!E14,\", \",'teacher-wise time-table'!E15,\", \",'teacher-wise time-table'!E16))","v":"12th C, ENGLISH 1 TO 6, MR. C"},{"$f":"IF('teacher-wise time-table'!F26=\"\",\"\",CONCATENATE('teacher-wise time-table'!F26,\", \",'teacher-wise time-table'!F27,\", \",'teacher-wise time-table'!F28))","v":"12th C, HISTORY 1 TO 6, MR. G"},{"$f":"IF('teacher-wise time-table'!G35=\"\",\"\",CONCATENATE('teacher-wise time-table'!G35,\", \",'teacher-wise time-table'!G36,\", \",'teacher-wise time-table'!G37))","v":"12th C+B, HOME. SC. 1-6, MR. J"},{"$f":"IF('teacher-wise time-table'!H11=\"\",\"\",CONCATENATE('teacher-wise time-table'!H11,\", \",'teacher-wise time-table'!H12,\", \",'teacher-wise time-table'!H13))","v":"12th D , PHYSICS 5,6, VACANT POST 1"},null,{"$f":"IF('teacher-wise time-table'!J53=\"\",\"\",CONCATENATE('teacher-wise time-table'!J53,\", \",'teacher-wise time-table'!J54,\", \",'teacher-wise time-table'!J55))","v":"12th D PHY. PR.,  D1 5,6  D2 1,2, MR. N"},{"$f":"IF('teacher-wise time-table'!K53=\"\",\"\",CONCATENATE('teacher-wise time-table'!K53,\", \",'teacher-wise time-table'!K54,\", \",'teacher-wise time-table'!K55))","v":"12th D PHY. PR.,  D1 5,6  D2 1,2, MR. N"},{"$f":"IF('teacher-wise time-table'!L38=\"\",\"\",CONCATENATE('teacher-wise time-table'!L38,\", \",'teacher-wise time-table'!L39,\", \",'teacher-wise time-table'!L40))","v":"12th C , URDU 2-6, MR. K"},{"$f":"IF('teacher-wise time-table'!M35=\"\",\"\",CONCATENATE('teacher-wise time-table'!M35,\", \",'teacher-wise time-table'!M36,\", \",'teacher-wise time-table'!M37))","v":"12th C, HOME. SC. 1,3-6, MR. J"}]
[{"$f":"'teacher-wise time-table'!A8","v":4},{"$f":"IF('teacher-wise time-table'!B8=\"\",\"\",CONCATENATE('teacher-wise time-table'!B8,\", \",'teacher-wise time-table'!B9,\", \",'teacher-wise time-table'!B10))","v":"MR. B, LECTURER , CHEMISTRY"},{"$f":"IF('teacher-wise time-table'!C8=\"\",\"\",CONCATENATE('teacher-wise time-table'!C8,\", \",'teacher-wise time-table'!C9,\", \",'teacher-wise time-table'!C10))","v":"LECTURER , CHEMISTRY, , "},{"$f":"IF('teacher-wise time-table'!D8=\"\",\"\",CONCATENATE('teacher-wise time-table'!D8,\", \",'teacher-wise time-table'!D9,\", \",'teacher-wise time-table'!D10))","v":"CT 12 D, NSS, SCIENCE CLUB              CT 12 D, , "},{"$f":"IF('teacher-wise time-table'!E26=\"\",\"\",CONCATENATE('teacher-wise time-table'!E26,\", \",'teacher-wise time-table'!E27,\", \",'teacher-wise time-table'!E28))","v":"12th B, HISTORY 1 TO 6, MR. G"},{"$f":"IF('teacher-wise time-table'!F14=\"\",\"\",CONCATENATE('teacher-wise time-table'!F14,\", \",'teacher-wise time-table'!F15,\", \",'teacher-wise time-table'!F16))","v":"12th B, ENGLISH 1 TO 6, MR. C"},{"$f":"IF('teacher-wise time-table'!G20=\"\",\"\",CONCATENATE('teacher-wise time-table'!G20,\", \",'teacher-wise time-table'!G21,\", \",'teacher-wise time-table'!G22))","v":"12th A, HINDI LIT. 1 TO 6, MR. E"},{"$f":"IF('teacher-wise time-table'!H20=\"\",\"\",CONCATENATE('teacher-wise time-table'!H20,\", \",'teacher-wise time-table'!H21,\", \",'teacher-wise time-table'!H22))","v":"12th C O,  HINDI COM. 1 TO 6, MR. E"},null,{"$f":"IF('teacher-wise time-table'!J50=\"\",\"\",CONCATENATE('teacher-wise time-table'!J50,\", \",'teacher-wise time-table'!J51,\", \",'teacher-wise time-table'!J52))","v":"12th D CHEM. PR.,  D1 3,4  D2 5,6, MR. M"},{"$f":"IF('teacher-wise time-table'!K8=\"\",\"\",CONCATENATE('teacher-wise time-table'!K8,\", \",'teacher-wise time-table'!K9,\", \",'teacher-wise time-table'!K10))","v":"12th D CHEM. PR.,  D1 3,4  D2 5,6, MR. B"},{"$f":"IF('teacher-wise time-table'!L29=\"\",\"\",CONCATENATE('teacher-wise time-table'!L29,\", \",'teacher-wise time-table'!L30,\", \",'teacher-wise time-table'!L31))","v":"12th B, POL. SC. 2-6, MR. H"},{"$f":"IF('teacher-wise time-table'!M26=\"\",\"\",CONCATENATE('teacher-wise time-table'!M26,\", \",'teacher-wise time-table'!M27,\", \",'teacher-wise time-table'!M28))","v":"12th B, HISTORY 1,3-6, MR. G"}]
[{"$f":"'teacher-wise time-table'!A9","v":5},null,null,null,{"$f":"IF('teacher-wise time-table'!E41=\"\",\"\",CONCATENATE('teacher-wise time-table'!E41,\", \",'teacher-wise time-table'!E42,\", \",'teacher-wise time-table'!E43))","v":"11th E, GEOGRAPHY 1-6, VACANT POST 2"},{"$f":"IF('teacher-wise time-table'!F29=\"\",\"\",CONCATENATE('teacher-wise time-table'!F29,\", \",'teacher-wise time-table'!F30,\", \",'teacher-wise time-table'!F31))","v":"12th A, POL. SC. 1 TO 6, MR. H"},{"$f":"IF('teacher-wise time-table'!G32=\"\",\"\",CONCATENATE('teacher-wise time-table'!G32,\", \",'teacher-wise time-table'!G33,\", \",'teacher-wise time-table'!G34))","v":"11th E+A, HOME SC. 1 TO 6, MR. I"},{"$f":"IF('teacher-wise time-table'!H23=\"\",\"\",CONCATENATE('teacher-wise time-table'!H23,\", \",'teacher-wise time-table'!H24,\", \",'teacher-wise time-table'!H25))","v":"12th B,  HINDI COM. 1 TO 6, MR. F"},null,{"$f":"IF('teacher-wise time-table'!J8=\"\",\"\",CONCATENATE('teacher-wise time-table'!J8,\", \",'teacher-wise time-table'!J9,\", \",'teacher-wise time-table'!J10))","v":"12th D CHEM. PR.,  D1 3,4  D2 5,6, MR. B"},{"$f":"IF('teacher-wise time-table'!K50=\"\",\"\",CONCATENATE('teacher-wise time-table'!K50,\", \",'teacher-wise time-table'!K51,\", \",'teacher-wise time-table'!K52))","v":"12th D CHEM. PR.,  D1 3,4  D2 5,6, 12th E+A RAJ ST 2 AM, MR. M"},{"$f":"IF('teacher-wise time-table'!L20=\"\",\"\",CONCATENATE('teacher-wise time-table'!L20,\", \",'teacher-wise time-table'!L21,\", \",'teacher-wise time-table'!L22))","v":"11th E+A, HINDI  1 TO 6, MR. E"},{"$f":"IF('teacher-wise time-table'!M41=\"\",\"\",CONCATENATE('teacher-wise time-table'!M41,\", \",'teacher-wise time-table'!M42,\", \",'teacher-wise time-table'!M43))","v":"11th E , GEOGRAPHY 1 TO 4, VACANT POST 2"}]
[{"$f":"'teacher-wise time-table'!A10","v":6},null,null,null,{"$f":"IF('teacher-wise time-table'!E11=\"\",\"\",CONCATENATE('teacher-wise time-table'!E11,\", \",'teacher-wise time-table'!E12,\", \",'teacher-wise time-table'!E13))","v":"11th D , PHYSICS 1 TO 6, VACANT POST 1"},{"$f":"IF('teacher-wise time-table'!F23=\"\",\"\",CONCATENATE('teacher-wise time-table'!F23,\", \",'teacher-wise time-table'!F24,\", \",'teacher-wise time-table'!F25))","v":"11th E+A,  HINDI LIT. 1 TO 6, MR. F"},{"$f":"IF('teacher-wise time-table'!G8=\"\",\"\",CONCATENATE('teacher-wise time-table'!G8,\", \",'teacher-wise time-table'!G9,\", \",'teacher-wise time-table'!G10))","v":"11th D, CHEMISTRY 1 TO 6, MR. B"},{"$f":"IF('teacher-wise time-table'!H14=\"\",\"\",CONCATENATE('teacher-wise time-table'!H14,\", \",'teacher-wise time-table'!H15,\", \",'teacher-wise time-table'!H16))","v":"12th A, ENGLISH 1 TO 6, MR. C"},null,{"$f":"IF('teacher-wise time-table'!J47=\"\",\"\",CONCATENATE('teacher-wise time-table'!J47,\", \",'teacher-wise time-table'!J48,\", \",'teacher-wise time-table'!J49))","v":"12th D BIO. PR.,  D1 1,2  D2 3,4, MR. L"},{"$f":"IF('teacher-wise time-table'!K47=\"\",\"\",CONCATENATE('teacher-wise time-table'!K47,\", \",'teacher-wise time-table'!K48,\", \",'teacher-wise time-table'!K49))","v":"12th D BIO. PR.,  D1 1,2  D2 3,4,12th C+B RAJ ST 6, MR. L"},{"$f":"IF('teacher-wise time-table'!L11=\"\",\"\",CONCATENATE('teacher-wise time-table'!L11,\", \",'teacher-wise time-table'!L12,\", \",'teacher-wise time-table'!L13))","v":"11th D PHY. PR.,  D1 1,2  D2 3,4, VACANT POST 1"},{"$f":"IF('teacher-wise time-table'!M11=\"\",\"\",CONCATENATE('teacher-wise time-table'!M11,\", \",'teacher-wise time-table'!M12,\", \",'teacher-wise time-table'!M13))","v":"11th D PHY. PR.,  D1 1,2  D2 3,4, VACANT POST 1"}]
[{"$f":"'teacher-wise time-table'!A11","v":7},{"$f":"IF('teacher-wise time-table'!B11=\"\",\"\",CONCATENATE('teacher-wise time-table'!B11,\", \",'teacher-wise time-table'!B12,\", \",'teacher-wise time-table'!B13))","v":"VACANT POST 1, LECTURER, PHYSICS "},{"$f":"IF('teacher-wise time-table'!C11=\"\",\"\",CONCATENATE('teacher-wise time-table'!C11,\", \",'teacher-wise time-table'!C12,\", \",'teacher-wise time-table'!C13))","v":"LECTURER, PHYSICS , , "},{"$f":"IF('teacher-wise time-table'!D11=\"\",\"\",CONCATENATE('teacher-wise time-table'!D11,\", \",'teacher-wise time-table'!D12,\", \",'teacher-wise time-table'!D13))","v":""},{"$f":"IF('teacher-wise time-table'!E20=\"\",\"\",CONCATENATE('teacher-wise time-table'!E20,\", \",'teacher-wise time-table'!E21,\", \",'teacher-wise time-table'!E22))","v":"11th C+B, HINDI COM. 1 TO 6, MR. E"},{"$f":"IF('teacher-wise time-table'!F5=\"\",\"\",CONCATENATE('teacher-wise time-table'!F5,\", \",'teacher-wise time-table'!F6,\", \",'teacher-wise time-table'!F7))","v":"11th D, BIOLOGY 1 TO 6, MR. A"},{"$f":"IF('teacher-wise time-table'!G17=\"\",\"\",CONCATENATE('teacher-wise time-table'!G17,\", \",'teacher-wise time-table'!G18,\", \",'teacher-wise time-table'!G19))","v":"11th C+B, ENGLISH 1 TO 6, MR. D"},{"$f":"IF('teacher-wise time-table'!H17=\"\",\"\",CONCATENATE('teacher-wise time-table'!H17,\", \",'teacher-wise time-table'!H18,\", \",'teacher-wise time-table'!H19))","v":"11th E+A, ENGLISH 1 TO 6, MR. D"},null,{"$f":"IF('teacher-wise time-table'!J5=\"\",\"\",CONCATENATE('teacher-wise time-table'!J5,\", \",'teacher-wise time-table'!J6,\", \",'teacher-wise time-table'!J7))","v":"12th D BIO. PR.,  D1 1,2  D2 3,4, MR. A"},{"$f":"IF('teacher-wise time-table'!K5=\"\",\"\",CONCATENATE('teacher-wise time-table'!K5,\", \",'teacher-wise time-table'!K6,\", \",'teacher-wise time-table'!K7))","v":"12th D BIO. PR.,  D1 1,2  D2 3,4, MR. A"},{"$f":"IF('teacher-wise time-table'!L53=\"\",\"\",CONCATENATE('teacher-wise time-table'!L53,\", \",'teacher-wise time-table'!L54,\", \",'teacher-wise time-table'!L55))","v":"11th D PHY. PR.,  D1 1,2  D2 3,4, MR. N"},{"$f":"IF('teacher-wise time-table'!M8=\"\",\"\",CONCATENATE('teacher-wise time-table'!M8,\", \",'teacher-wise time-table'!M9,\", \",'teacher-wise time-table'!M10))","v":"11th D CHEM . PR.,  D1 5,6  D2 1,2, MR. B"}]
[{"$f":"'teacher-wise time-table'!A12","v":8},null,null,null,{"$f":"IF('teacher-wise time-table'!E29=\"\",\"\",CONCATENATE('teacher-wise time-table'!E29,\", \",'teacher-wise time-table'!E30,\", \",'teacher-wise time-table'!E31))","v":"11th A, POL. SC. 1 TO 6, MR. H"},{"$f":"IF('teacher-wise time-table'!F32=\"\",\"\",CONCATENATE('teacher-wise time-table'!F32,\", \",'teacher-wise time-table'!F33,\", \",'teacher-wise time-table'!F34))","v":"11th C+B , HOME SC. 1 TO 6, MR. I"},{"$f":"IF('teacher-wise time-table'!G11=\"\",\"\",CONCATENATE('teacher-wise time-table'!G11,\", \",'teacher-wise time-table'!G12,\", \",'teacher-wise time-table'!G13))","v":""},{"$f":"IF('teacher-wise time-table'!H53=\"\",\"\",CONCATENATE('teacher-wise time-table'!H53,\", \",'teacher-wise time-table'!H54,\", \",'teacher-wise time-table'!H55))","v":"11th D, RAJ ST 1-3 JK 4-6, MR. N"},null,{"$f":"IF('teacher-wise time-table'!J38=\"\",\"\",CONCATENATE('teacher-wise time-table'!J38,\", \",'teacher-wise time-table'!J39,\", \",'teacher-wise time-table'!J40))","v":"12th C , URDU 1 TO 6, MR. K"},{"$f":"IF('teacher-wise time-table'!K26=\"\",\"\",CONCATENATE('teacher-wise time-table'!K26,\", \",'teacher-wise time-table'!K27,\", \",'teacher-wise time-table'!K28))","v":"12th C , HISTORY 1 TO 5, MR. G"},{"$f":"IF('teacher-wise time-table'!L50=\"\",\"\",CONCATENATE('teacher-wise time-table'!L50,\", \",'teacher-wise time-table'!L51,\", \",'teacher-wise time-table'!L52))","v":"11th D CHEM . PR.,  D1 5,6  D2 1,2,12th E+A RAJ STD 3 AM, MR. M"},{"$f":"IF('teacher-wise time-table'!M50=\"\",\"\",CONCATENATE('teacher-wise time-table'!M50,\", \",'teacher-wise time-table'!M51,\", \",'teacher-wise time-table'!M52))","v":"11th D CHEM . PR.,  D1 5,6  D2 1,2, 12th E+A RAJ STD 4 AM, MR. M"}]
[{"$f":"'teacher-wise time-table'!A13","v":9},null,null,null,{"$f":"IF('teacher-wise time-table'!E5=\"\",\"\",CONCATENATE('teacher-wise time-table'!E5,\", \",'teacher-wise time-table'!E6,\", \",'teacher-wise time-table'!E7))","v":""},{"$f":"IF('teacher-wise time-table'!F8=\"\",\"\",CONCATENATE('teacher-wise time-table'!F8,\", \",'teacher-wise time-table'!F9,\", \",'teacher-wise time-table'!F10))","v":""},{"$f":"IF('teacher-wise time-table'!G14=\"\",\"\",CONCATENATE('teacher-wise time-table'!G14,\", \",'teacher-wise time-table'!G15,\", \",'teacher-wise time-table'!G16))","v":""},{"$f":"IF('teacher-wise time-table'!H26=\"\",\"\",CONCATENATE('teacher-wise time-table'!H26,\", \",'teacher-wise time-table'!H27,\", \",'teacher-wise time-table'!H28))","v":"11th C+B, HISTORY 1 TO 6, MR. G"},null,{"$f":"IF('teacher-wise time-table'!J29=\"\",\"\",CONCATENATE('teacher-wise time-table'!J29,\", \",'teacher-wise time-table'!J30,\", \",'teacher-wise time-table'!J31))","v":"12th B, POL. SC. 1 TO 6, MR. H"},{"$f":"IF('teacher-wise time-table'!K35=\"\",\"\",CONCATENATE('teacher-wise time-table'!K35,\", \",'teacher-wise time-table'!K36,\", \",'teacher-wise time-table'!K37))","v":"12th B, HOME. SC. 1 TO 5, MR. J"},{"$f":"IF('teacher-wise time-table'!L8=\"\",\"\",CONCATENATE('teacher-wise time-table'!L8,\", \",'teacher-wise time-table'!L9,\", \",'teacher-wise time-table'!L10))","v":"11th D CHEM . PR.,  D1 5,6  D2 1,2, MR. B"},{"$f":"IF('teacher-wise time-table'!M5=\"\",\"\",CONCATENATE('teacher-wise time-table'!M5,\", \",'teacher-wise time-table'!M6,\", \",'teacher-wise time-table'!M7))","v":"11th D BIO. PR.,  D1 3,4  D2 5,6, MR. A"}]
[{"$f":"'teacher-wise time-table'!A14","v":10},{"$f":"IF('teacher-wise time-table'!B14=\"\",\"\",CONCATENATE('teacher-wise time-table'!B14,\", \",'teacher-wise time-table'!B15,\", \",'teacher-wise time-table'!B16))","v":"MR. C, LECTURER, ENGLISH "},{"$f":"IF('teacher-wise time-table'!C14=\"\",\"\",CONCATENATE('teacher-wise time-table'!C14,\", \",'teacher-wise time-table'!C15,\", \",'teacher-wise time-table'!C16))","v":"LECTURER, ENGLISH , , "},{"$f":"IF('teacher-wise time-table'!D14=\"\",\"\",CONCATENATE('teacher-wise time-table'!D14,\", \",'teacher-wise time-table'!D15,\", \",'teacher-wise time-table'!D16))","v":"FIRST ASSISTANT, LOCAL EXAM.. TIME TABLE INCHARGE, STATE . ICT CO-ORDINATOR, , "},{"$f":"IF('teacher-wise time-table'!E17=\"\",\"\",CONCATENATE('teacher-wise time-table'!E17,\", \",'teacher-wise time-table'!E18,\", \",'teacher-wise time-table'!E19))","v":""},{"$f":"IF('teacher-wise time-table'!F17=\"\",\"\",CONCATENATE('teacher-wise time-table'!F17,\", \",'teacher-wise time-table'!F18,\", \",'teacher-wise time-table'!F19))","v":""},{"$f":"IF('teacher-wise time-table'!G26=\"\",\"\",CONCATENATE('teacher-wise time-table'!G26,\", \",'teacher-wise time-table'!G27,\", \",'teacher-wise time-table'!G28))","v":""},{"$f":"IF('teacher-wise time-table'!H5=\"\",\"\",CONCATENATE('teacher-wise time-table'!H5,\", \",'teacher-wise time-table'!H6,\", \",'teacher-wise time-table'!H7))","v":""},null,{"$f":"IF('teacher-wise time-table'!J35=\"\",\"\",CONCATENATE('teacher-wise time-table'!J35,\", \",'teacher-wise time-table'!J36,\", \",'teacher-wise time-table'!J37))","v":"12th A, HOME SC. 1 TO 6, MR. J"},{"$f":"IF('teacher-wise time-table'!K29=\"\",\"\",CONCATENATE('teacher-wise time-table'!K29,\", \",'teacher-wise time-table'!K30,\", \",'teacher-wise time-table'!K31))","v":"12th A, POL. SC. 1, 3 TO 6, MR. H"},{"$f":"IF('teacher-wise time-table'!L5=\"\",\"\",CONCATENATE('teacher-wise time-table'!L5,\", \",'teacher-wise time-table'!L6,\", \",'teacher-wise time-table'!L7))","v":"11th D BIO. PR.,  D1 3,4  D2 5,6, MR. A"},{"$f":"IF('teacher-wise time-table'!M47=\"\",\"\",CONCATENATE('teacher-wise time-table'!M47,\", \",'teacher-wise time-table'!M48,\", \",'teacher-wise time-table'!M49))","v":"11th D BIO. PR.,  D1 3,4  D2 5,6, 12th C+B RAJ ST 2, MR. L"}]
[{"$f":"'teacher-wise time-table'!A15","v":11},null,null,null,{"$f":"IF('teacher-wise time-table'!E32=\"\",\"\",CONCATENATE('teacher-wise time-table'!E32,\", \",'teacher-wise time-table'!E33,\", \",'teacher-wise time-table'!E34))","v":""},{"$f":"IF('teacher-wise time-table'!F20=\"\",\"\",CONCATENATE('teacher-wise time-table'!F20,\", \",'teacher-wise time-table'!F21,\", \",'teacher-wise time-table'!F22))","v":""},{"$f":"IF('teacher-wise time-table'!G29=\"\",\"\",CONCATENATE('teacher-wise time-table'!G29,\", \",'teacher-wise time-table'!G30,\", \",'teacher-wise time-table'!G31))","v":""},{"$f":"IF('teacher-wise time-table'!H29=\"\",\"\",CONCATENATE('teacher-wise time-table'!H29,\", \",'teacher-wise time-table'!H30,\", \",'teacher-wise time-table'!H31))","v":""},null,{"$f":"IF('teacher-wise time-table'!J32=\"\",\"\",CONCATENATE('teacher-wise time-table'!J32,\", \",'teacher-wise time-table'!J33,\", \",'teacher-wise time-table'!J34))","v":"11th E+A, HOME SC. 1 TO 4, MR. I"},{"$f":"IF('teacher-wise time-table'!K23=\"\",\"\",CONCATENATE('teacher-wise time-table'!K23,\", \",'teacher-wise time-table'!K24,\", \",'teacher-wise time-table'!K25))","v":"11th E+A,  HINDI LIT. 3 TO 6, MR. F"},{"$f":"IF('teacher-wise time-table'!L47=\"\",\"\",CONCATENATE('teacher-wise time-table'!L47,\", \",'teacher-wise time-table'!L48,\", \",'teacher-wise time-table'!L49))","v":"11th D BIO. PR.,  D1 3,4  D2 5,6, 12th C+B RAJ ST 1, MR. L"},{"$f":"IF('teacher-wise time-table'!M38=\"\",\"\",CONCATENATE('teacher-wise time-table'!M38,\", \",'teacher-wise time-table'!M39,\", \",'teacher-wise time-table'!M40))","v":"11th C , URDU 1 TO 4, MR. K"}]
[{"$f":"'teacher-wise time-table'!A16","v":12},null,null,null,{"$f":"IF('teacher-wise time-table'!E35=\"\",\"\",CONCATENATE('teacher-wise time-table'!E35,\", \",'teacher-wise time-table'!E36,\", \",'teacher-wise time-table'!E37))","v":""},{"$f":"IF('teacher-wise time-table'!F35=\"\",\"\",CONCATENATE('teacher-wise time-table'!F35,\", \",'teacher-wise time-table'!F36,\", \",'teacher-wise time-table'!F37))","v":""},{"$f":"IF('teacher-wise time-table'!G38=\"\",\"\",CONCATENATE('teacher-wise time-table'!G38,\", \",'teacher-wise time-table'!G39,\", \",'teacher-wise time-table'!G40))","v":""},{"$f":"IF('teacher-wise time-table'!H32=\"\",\"\",CONCATENATE('teacher-wise time-table'!H32,\", \",'teacher-wise time-table'!H33,\", \",'teacher-wise time-table'!H34))","v":""},null,{"$f":"IF('teacher-wise time-table'!J20=\"\",\"\",CONCATENATE('teacher-wise time-table'!J20,\", \",'teacher-wise time-table'!J21,\", \",'teacher-wise time-table'!J22))","v":"11th D, HINDI  1 TO 6, MR. E"},{"$f":"IF('teacher-wise time-table'!K17=\"\",\"\",CONCATENATE('teacher-wise time-table'!K17,\", \",'teacher-wise time-table'!K18,\", \",'teacher-wise time-table'!K19))","v":"11th D, ENGLISH 1 TO 6, MR. D"},{"$f":"IF('teacher-wise time-table'!L32=\"\",\"\",CONCATENATE('teacher-wise time-table'!L32,\", \",'teacher-wise time-table'!L33,\", \",'teacher-wise time-table'!L34))","v":"11th C+B , HOME SC. 3 TO 6, MR. I"},{"$f":"IF('teacher-wise time-table'!M32=\"\",\"\",CONCATENATE('teacher-wise time-table'!M32,\", \",'teacher-wise time-table'!M33,\", \",'teacher-wise time-table'!M34))","v":"11th B , POL. SC. 1 TO 4, MR. I"}]
[{"$f":"'teacher-wise time-table'!A17","v":13},{"$f":"IF('teacher-wise time-table'!B17=\"\",\"\",CONCATENATE('teacher-wise time-table'!B17,\", \",'teacher-wise time-table'!B18,\", \",'teacher-wise time-table'!B19))","v":"MR. D, G. LECTURER, ENGLISH"},{"$f":"IF('teacher-wise time-table'!C17=\"\",\"\",CONCATENATE('teacher-wise time-table'!C17,\", \",'teacher-wise time-table'!C18,\", \",'teacher-wise time-table'!C19))","v":"G. LECTURER, ENGLISH, , "},{"$f":"IF('teacher-wise time-table'!D17=\"\",\"\",CONCATENATE('teacher-wise time-table'!D17,\", \",'teacher-wise time-table'!D18,\", \",'teacher-wise time-table'!D19))","v":"CT 12 E, , "},{"$f":"IF('teacher-wise time-table'!E38=\"\",\"\",CONCATENATE('teacher-wise time-table'!E38,\", \",'teacher-wise time-table'!E39,\", \",'teacher-wise time-table'!E40))","v":""},{"$f":"IF('teacher-wise time-table'!F38=\"\",\"\",CONCATENATE('teacher-wise time-table'!F38,\", \",'teacher-wise time-table'!F39,\", \",'teacher-wise time-table'!F40))","v":""},{"$f":"IF('teacher-wise time-table'!G41=\"\",\"\",CONCATENATE('teacher-wise time-table'!G41,\", \",'teacher-wise time-table'!G42,\", \",'teacher-wise time-table'!G43))","v":""},{"$f":"IF('teacher-wise time-table'!H38=\"\",\"\",CONCATENATE('teacher-wise time-table'!H38,\", \",'teacher-wise time-table'!H39,\", \",'teacher-wise time-table'!H40))","v":""},null,{"$f":"IF('teacher-wise time-table'!J26=\"\",\"\",CONCATENATE('teacher-wise time-table'!J26,\", \",'teacher-wise time-table'!J27,\", \",'teacher-wise time-table'!J28))","v":"11th C+B , HISTORY 3 TO 6, MR. G"},{"$f":"IF('teacher-wise time-table'!K38=\"\",\"\",CONCATENATE('teacher-wise time-table'!K38,\", \",'teacher-wise time-table'!K39,\", \",'teacher-wise time-table'!K40))","v":"11th C , URDU 1 TO 6, MR. K"},{"$f":"IF('teacher-wise time-table'!L44=\"\",\"\",CONCATENATE('teacher-wise time-table'!L44,\", \",'teacher-wise time-table'!L45,\", \",'teacher-wise time-table'!L46))","v":"11 C+B  RAJ STD 1,2, , MR. K"},{"$f":"IF('teacher-wise time-table'!M29=\"\",\"\",CONCATENATE('teacher-wise time-table'!M29,\", \",'teacher-wise time-table'!M30,\", \",'teacher-wise time-table'!M31))","v":"11th A, POL. SC. 1 TO 4, MR. H"}]
[{"$f":"'teacher-wise time-table'!A18","v":14},null,null,null,{"$f":"IF('teacher-wise time-table'!E44=\"\",\"\",CONCATENATE('teacher-wise time-table'!E44,\", \",'teacher-wise time-table'!E45,\", \",'teacher-wise time-table'!E46))","v":""},{"$f":"IF('teacher-wise time-table'!F44=\"\",\"\",CONCATENATE('teacher-wise time-table'!F44,\", \",'teacher-wise time-table'!F45,\", \",'teacher-wise time-table'!F46))","v":""},{"$f":"IF('teacher-wise time-table'!G44=\"\",\"\",CONCATENATE('teacher-wise time-table'!G44,\", \",'teacher-wise time-table'!G45,\", \",'teacher-wise time-table'!G46))","v":""},{"$f":"IF('teacher-wise time-table'!H41=\"\",\"\",CONCATENATE('teacher-wise time-table'!H41,\", \",'teacher-wise time-table'!H42,\", \",'teacher-wise time-table'!H43))","v":""},null,{"$f":"IF('teacher-wise time-table'!J44=\"\",\"\",CONCATENATE('teacher-wise time-table'!J44,\", \",'teacher-wise time-table'!J45,\", \",'teacher-wise time-table'!J46))","v":"11 B ,C RAJ ST 3, JK 4,  11 E+A RAJ ST 5,6 SG, , MR. K"},{"$f":"IF('teacher-wise time-table'!K32=\"\",\"\",CONCATENATE('teacher-wise time-table'!K32,\", \",'teacher-wise time-table'!K33,\", \",'teacher-wise time-table'!K34))","v":"11th B, POL. SC. 1 TO 6, MR. I"},{"$f":"IF('teacher-wise time-table'!L17=\"\",\"\",CONCATENATE('teacher-wise time-table'!L17,\", \",'teacher-wise time-table'!L18,\", \",'teacher-wise time-table'!L19))","v":""},{"$f":"IF('teacher-wise time-table'!M44=\"\",\"\",CONCATENATE('teacher-wise time-table'!M44,\", \",'teacher-wise time-table'!M45,\", \",'teacher-wise time-table'!M46))","v":"11 C+B  RAJ STD 5,6,          11 E+A JK  5 RAJ ST 6 SG, , MR. K"}]
[{"$f":"'teacher-wise time-table'!A19","v":15},null,null,null,{"$f":"IF('teacher-wise time-table'!E47=\"\",\"\",CONCATENATE('teacher-wise time-table'!E47,\", \",'teacher-wise time-table'!E48,\", \",'teacher-wise time-table'!E49))","v":""},{"$f":"IF('teacher-wise time-table'!F47=\"\",\"\",CONCATENATE('teacher-wise time-table'!F47,\", \",'teacher-wise time-table'!F48,\", \",'teacher-wise time-table'!F49))","v":""},{"$f":"IF('teacher-wise time-table'!G47=\"\",\"\",CONCATENATE('teacher-wise time-table'!G47,\", \",'teacher-wise time-table'!G48,\", \",'teacher-wise time-table'!G49))","v":""},{"$f":"IF('teacher-wise time-table'!H44=\"\",\"\",CONCATENATE('teacher-wise time-table'!H44,\", \",'teacher-wise time-table'!H45,\", \",'teacher-wise time-table'!H46))","v":""},null,{"$f":"IF('teacher-wise time-table'!J17=\"\",\"\",CONCATENATE('teacher-wise time-table'!J17,\", \",'teacher-wise time-table'!J18,\", \",'teacher-wise time-table'!J19))","v":""},{"$f":"IF('teacher-wise time-table'!K44=\"\",\"\",CONCATENATE('teacher-wise time-table'!K44,\", \",'teacher-wise time-table'!K45,\", \",'teacher-wise time-table'!K46))","v":"11 E+A JK  1,2 SG, , MR. K"},{"$f":"IF('teacher-wise time-table'!L23=\"\",\"\",CONCATENATE('teacher-wise time-table'!L23,\", \",'teacher-wise time-table'!L24,\", \",'teacher-wise time-table'!L25))","v":""},{"$f":"IF('teacher-wise time-table'!M14=\"\",\"\",CONCATENATE('teacher-wise time-table'!M14,\", \",'teacher-wise time-table'!M15,\", \",'teacher-wise time-table'!M16))","v":""}]
[{"$f":"'teacher-wise time-table'!A20","v":16},{"$f":"IF('teacher-wise time-table'!B20=\"\",\"\",CONCATENATE('teacher-wise time-table'!B20,\", \",'teacher-wise time-table'!B21,\", \",'teacher-wise time-table'!B22))","v":"MR. E, LECTURER, HINDI "},{"$f":"IF('teacher-wise time-table'!C20=\"\",\"\",CONCATENATE('teacher-wise time-table'!C20,\", \",'teacher-wise time-table'!C21,\", \",'teacher-wise time-table'!C22))","v":"LECTURER, HINDI , , "},{"$f":"IF('teacher-wise time-table'!D20=\"\",\"\",CONCATENATE('teacher-wise time-table'!D20,\", \",'teacher-wise time-table'!D21,\", \",'teacher-wise time-table'!D22))","v":"SECRETARY SDMC,                    CT 11 B, , "},{"$f":"IF('teacher-wise time-table'!E50=\"\",\"\",CONCATENATE('teacher-wise time-table'!E50,\", \",'teacher-wise time-table'!E51,\", \",'teacher-wise time-table'!E52))","v":""},{"$f":"IF('teacher-wise time-table'!F50=\"\",\"\",CONCATENATE('teacher-wise time-table'!F50,\", \",'teacher-wise time-table'!F51,\", \",'teacher-wise time-table'!F52))","v":""},{"$f":"IF('teacher-wise time-table'!G50=\"\",\"\",CONCATENATE('teacher-wise time-table'!G50,\", \",'teacher-wise time-table'!G51,\", \",'teacher-wise time-table'!G52))","v":""},{"$f":"IF('teacher-wise time-table'!H47=\"\",\"\",CONCATENATE('teacher-wise time-table'!H47,\", \",'teacher-wise time-table'!H48,\", \",'teacher-wise time-table'!H49))","v":""},null,{"$f":"IF('teacher-wise time-table'!J23=\"\",\"\",CONCATENATE('teacher-wise time-table'!J23,\", \",'teacher-wise time-table'!J24,\", \",'teacher-wise time-table'!J25))","v":""},{"$f":"IF('teacher-wise time-table'!K14=\"\",\"\",CONCATENATE('teacher-wise time-table'!K14,\", \",'teacher-wise time-table'!K15,\", \",'teacher-wise time-table'!K16))","v":""},{"$f":"IF('teacher-wise time-table'!L26=\"\",\"\",CONCATENATE('teacher-wise time-table'!L26,\", \",'teacher-wise time-table'!L27,\", \",'teacher-wise time-table'!L28))","v":""},{"$f":"IF('teacher-wise time-table'!M17=\"\",\"\",CONCATENATE('teacher-wise time-table'!M17,\", \",'teacher-wise time-table'!M18,\", \",'teacher-wise time-table'!M19))","v":""}]
[{"$f":"'teacher-wise time-table'!A21","v":17},null,null,null,{"$f":"IF('teacher-wise time-table'!E53=\"\",\"\",CONCATENATE('teacher-wise time-table'!E53,\", \",'teacher-wise time-table'!E54,\", \",'teacher-wise time-table'!E55))","v":""},{"$f":"IF('teacher-wise time-table'!F53=\"\",\"\",CONCATENATE('teacher-wise time-table'!F53,\", \",'teacher-wise time-table'!F54,\", \",'teacher-wise time-table'!F55))","v":""},{"$f":"IF('teacher-wise time-table'!G53=\"\",\"\",CONCATENATE('teacher-wise time-table'!G53,\", \",'teacher-wise time-table'!G54,\", \",'teacher-wise time-table'!G55))","v":""},{"$f":"IF('teacher-wise time-table'!H50=\"\",\"\",CONCATENATE('teacher-wise time-table'!H50,\", \",'teacher-wise time-table'!H51,\", \",'teacher-wise time-table'!H52))","v":""},null,{"$f":"IF('teacher-wise time-table'!J41=\"\",\"\",CONCATENATE('teacher-wise time-table'!J41,\", \",'teacher-wise time-table'!J42,\", \",'teacher-wise time-table'!J43))","v":""},{"$f":"IF('teacher-wise time-table'!K20=\"\",\"\",CONCATENATE('teacher-wise time-table'!K20,\", \",'teacher-wise time-table'!K21,\", \",'teacher-wise time-table'!K22))","v":""},{"$f":"IF('teacher-wise time-table'!L41=\"\",\"\",CONCATENATE('teacher-wise time-table'!L41,\", \",'teacher-wise time-table'!L42,\", \",'teacher-wise time-table'!L43))","v":""},{"$f":"IF('teacher-wise time-table'!M53=\"\",\"\",CONCATENATE('teacher-wise time-table'!M53,\", \",'teacher-wise time-table'!M54,\", \",'teacher-wise time-table'!M55))","v":""}]
[{"$f":"'teacher-wise time-table'!A22","v":18},null,null,null,{"$f":"IF('teacher-wise time-table'!E56=\"\",\"\",CONCATENATE('teacher-wise time-table'!E56,\", \",'teacher-wise time-table'!E57,\", \",'teacher-wise time-table'!E58))","v":""},{"$f":"IF('teacher-wise time-table'!F56=\"\",\"\",CONCATENATE('teacher-wise time-table'!F56,\", \",'teacher-wise time-table'!F57,\", \",'teacher-wise time-table'!F58))","v":""},{"$f":"IF('teacher-wise time-table'!G56=\"\",\"\",CONCATENATE('teacher-wise time-table'!G56,\", \",'teacher-wise time-table'!G57,\", \",'teacher-wise time-table'!G58))","v":""},{"$f":"IF('teacher-wise time-table'!H56=\"\",\"\",CONCATENATE('teacher-wise time-table'!H56,\", \",'teacher-wise time-table'!H57,\", \",'teacher-wise time-table'!H58))","v":""},null,{"$f":"IF('teacher-wise time-table'!J56=\"\",\"\",CONCATENATE('teacher-wise time-table'!J56,\", \",'teacher-wise time-table'!J57,\", \",'teacher-wise time-table'!J58))","v":""},{"$f":"IF('teacher-wise time-table'!K56=\"\",\"\",CONCATENATE('teacher-wise time-table'!K56,\", \",'teacher-wise time-table'!K57,\", \",'teacher-wise time-table'!K58))","v":""},{"$f":"IF('teacher-wise time-table'!L56=\"\",\"\",CONCATENATE('teacher-wise time-table'!L56,\", \",'teacher-wise time-table'!L57,\", \",'teacher-wise time-table'!L58))","v":""},{"$f":"IF('teacher-wise time-table'!M56=\"\",\"\",CONCATENATE('teacher-wise time-table'!M56,\", \",'teacher-wise time-table'!M57,\", \",'teacher-wise time-table'!M58))","v":""}]
[{"$f":"'teacher-wise time-table'!A23","v":19},{"$f":"IF('teacher-wise time-table'!B23=\"\",\"\",CONCATENATE('teacher-wise time-table'!B23,\", \",'teacher-wise time-table'!B24,\", \",'teacher-wise time-table'!B25))","v":"MR. F, LECTURER , HINDI"},{"$f":"IF('teacher-wise time-table'!C23=\"\",\"\",CONCATENATE('teacher-wise time-table'!C23,\", \",'teacher-wise time-table'!C24,\", \",'teacher-wise time-table'!C25))","v":"LECTURER , HINDI, , "},{"$f":"IF('teacher-wise time-table'!D23=\"\",\"\",CONCATENATE('teacher-wise time-table'!D23,\", \",'teacher-wise time-table'!D24,\", \",'teacher-wise time-table'!D25))","v":"PYAYER ASSEMBLY, G.K., CT 12 A, , "},{"$f":"IF('teacher-wise time-table'!E59=\"\",\"\",CONCATENATE('teacher-wise time-table'!E59,\", \",'teacher-wise time-table'!E60,\", \",'teacher-wise time-table'!E61))","v":""},{"$f":"IF('teacher-wise time-table'!F59=\"\",\"\",CONCATENATE('teacher-wise time-table'!F59,\", \",'teacher-wise time-table'!F60,\", \",'teacher-wise time-table'!F61))","v":""},{"$f":"IF('teacher-wise time-table'!G59=\"\",\"\",CONCATENATE('teacher-wise time-table'!G59,\", \",'teacher-wise time-table'!G60,\", \",'teacher-wise time-table'!G61))","v":""},{"$f":"IF('teacher-wise time-table'!H59=\"\",\"\",CONCATENATE('teacher-wise time-table'!H59,\", \",'teacher-wise time-table'!H60,\", \",'teacher-wise time-table'!H61))","v":""},null,{"$f":"IF('teacher-wise time-table'!J59=\"\",\"\",CONCATENATE('teacher-wise time-table'!J59,\", \",'teacher-wise time-table'!J60,\", \",'teacher-wise time-table'!J61))","v":""},{"$f":"IF('teacher-wise time-table'!K59=\"\",\"\",CONCATENATE('teacher-wise time-table'!K59,\", \",'teacher-wise time-table'!K60,\", \",'teacher-wise time-table'!K61))","v":""},{"$f":"IF('teacher-wise time-table'!L59=\"\",\"\",CONCATENATE('teacher-wise time-table'!L59,\", \",'teacher-wise time-table'!L60,\", \",'teacher-wise time-table'!L61))","v":""},{"$f":"IF('teacher-wise time-table'!M59=\"\",\"\",CONCATENATE('teacher-wise time-table'!M59,\", \",'teacher-wise time-table'!M60,\", \",'teacher-wise time-table'!M61))","v":""}]
[{"$f":"'teacher-wise time-table'!A24","v":20},null,null,null,{"$f":"IF('teacher-wise time-table'!E62=\"\",\"\",CONCATENATE('teacher-wise time-table'!E62,\", \",'teacher-wise time-table'!E63,\", \",'teacher-wise time-table'!E64))","v":""},{"$f":"IF('teacher-wise time-table'!F62=\"\",\"\",CONCATENATE('teacher-wise time-table'!F62,\", \",'teacher-wise time-table'!F63,\", \",'teacher-wise time-table'!F64))","v":""},{"$f":"IF('teacher-wise time-table'!G62=\"\",\"\",CONCATENATE('teacher-wise time-table'!G62,\", \",'teacher-wise time-table'!G63,\", \",'teacher-wise time-table'!G64))","v":""},{"$f":"IF('teacher-wise time-table'!H62=\"\",\"\",CONCATENATE('teacher-wise time-table'!H62,\", \",'teacher-wise time-table'!H63,\", \",'teacher-wise time-table'!H64))","v":""},null,{"$f":"IF('teacher-wise time-table'!J62=\"\",\"\",CONCATENATE('teacher-wise time-table'!J62,\", \",'teacher-wise time-table'!J63,\", \",'teacher-wise time-table'!J64))","v":""},{"$f":"IF('teacher-wise time-table'!K62=\"\",\"\",CONCATENATE('teacher-wise time-table'!K62,\", \",'teacher-wise time-table'!K63,\", \",'teacher-wise time-table'!K64))","v":""},{"$f":"IF('teacher-wise time-table'!L62=\"\",\"\",CONCATENATE('teacher-wise time-table'!L62,\", \",'teacher-wise time-table'!L63,\", \",'teacher-wise time-table'!L64))","v":""},{"$f":"IF('teacher-wise time-table'!M62=\"\",\"\",CONCATENATE('teacher-wise time-table'!M62,\", \",'teacher-wise time-table'!M63,\", \",'teacher-wise time-table'!M64))","v":""}]
[{"$f":"'teacher-wise time-table'!A25","v":21},null,null,null,{"$f":"IF('teacher-wise time-table'!E65=\"\",\"\",CONCATENATE('teacher-wise time-table'!E65,\", \",'teacher-wise time-table'!E66,\", \",'teacher-wise time-table'!E67))","v":""},{"$f":"IF('teacher-wise time-table'!F65=\"\",\"\",CONCATENATE('teacher-wise time-table'!F65,\", \",'teacher-wise time-table'!F66,\", \",'teacher-wise time-table'!F67))","v":""},{"$f":"IF('teacher-wise time-table'!G65=\"\",\"\",CONCATENATE('teacher-wise time-table'!G65,\", \",'teacher-wise time-table'!G66,\", \",'teacher-wise time-table'!G67))","v":""},{"$f":"IF('teacher-wise time-table'!H65=\"\",\"\",CONCATENATE('teacher-wise time-table'!H65,\", \",'teacher-wise time-table'!H66,\", \",'teacher-wise time-table'!H67))","v":""},null,{"$f":"IF('teacher-wise time-table'!J65=\"\",\"\",CONCATENATE('teacher-wise time-table'!J65,\", \",'teacher-wise time-table'!J66,\", \",'teacher-wise time-table'!J67))","v":""},{"$f":"IF('teacher-wise time-table'!K65=\"\",\"\",CONCATENATE('teacher-wise time-table'!K65,\", \",'teacher-wise time-table'!K66,\", \",'teacher-wise time-table'!K67))","v":""},{"$f":"IF('teacher-wise time-table'!L65=\"\",\"\",CONCATENATE('teacher-wise time-table'!L65,\", \",'teacher-wise time-table'!L66,\", \",'teacher-wise time-table'!L67))","v":""},{"$f":"IF('teacher-wise time-table'!M65=\"\",\"\",CONCATENATE('teacher-wise time-table'!M65,\", \",'teacher-wise time-table'!M66,\", \",'teacher-wise time-table'!M67))","v":""}]
[{"$f":"'teacher-wise time-table'!A26","v":22},{"$f":"IF('teacher-wise time-table'!B26=\"\",\"\",CONCATENATE('teacher-wise time-table'!B26,\", \",'teacher-wise time-table'!B27,\", \",'teacher-wise time-table'!B28))","v":"MR. G, LECTURER , HISTORY"},{"$f":"IF('teacher-wise time-table'!C26=\"\",\"\",CONCATENATE('teacher-wise time-table'!C26,\", \",'teacher-wise time-table'!C27,\", \",'teacher-wise time-table'!C28))","v":"LECTURER , HISTORY, , "},{"$f":"IF('teacher-wise time-table'!D26=\"\",\"\",CONCATENATE('teacher-wise time-table'!D26,\", \",'teacher-wise time-table'!D27,\", \",'teacher-wise time-table'!D28))","v":"SCHOOL PLAN, HERITAGE CLUC+BT 12 B, , "},{"$f":"IF('teacher-wise time-table'!E68=\"\",\"\",CONCATENATE('teacher-wise time-table'!E68,\", \",'teacher-wise time-table'!E69,\", \",'teacher-wise time-table'!E70))","v":""},{"$f":"IF('teacher-wise time-table'!F68=\"\",\"\",CONCATENATE('teacher-wise time-table'!F68,\", \",'teacher-wise time-table'!F69,\", \",'teacher-wise time-table'!F70))","v":""},{"$f":"IF('teacher-wise time-table'!G68=\"\",\"\",CONCATENATE('teacher-wise time-table'!G68,\", \",'teacher-wise time-table'!G69,\", \",'teacher-wise time-table'!G70))","v":""},{"$f":"IF('teacher-wise time-table'!H68=\"\",\"\",CONCATENATE('teacher-wise time-table'!H68,\", \",'teacher-wise time-table'!H69,\", \",'teacher-wise time-table'!H70))","v":""},null,{"$f":"IF('teacher-wise time-table'!J68=\"\",\"\",CONCATENATE('teacher-wise time-table'!J68,\", \",'teacher-wise time-table'!J69,\", \",'teacher-wise time-table'!J70))","v":""},{"$f":"IF('teacher-wise time-table'!K68=\"\",\"\",CONCATENATE('teacher-wise time-table'!K68,\", \",'teacher-wise time-table'!K69,\", \",'teacher-wise time-table'!K70))","v":""},{"$f":"IF('teacher-wise time-table'!L68=\"\",\"\",CONCATENATE('teacher-wise time-table'!L68,\", \",'teacher-wise time-table'!L69,\", \",'teacher-wise time-table'!L70))","v":""},{"$f":"IF('teacher-wise time-table'!M68=\"\",\"\",CONCATENATE('teacher-wise time-table'!M68,\", \",'teacher-wise time-table'!M69,\", \",'teacher-wise time-table'!M70))","v":""}]
[{"$f":"'teacher-wise time-table'!A27","v":23},null,null,null,{"$f":"IF('teacher-wise time-table'!E71=\"\",\"\",CONCATENATE('teacher-wise time-table'!E71,\", \",'teacher-wise time-table'!E72,\", \",'teacher-wise time-table'!E73))","v":""},{"$f":"IF('teacher-wise time-table'!F71=\"\",\"\",CONCATENATE('teacher-wise time-table'!F71,\", \",'teacher-wise time-table'!F72,\", \",'teacher-wise time-table'!F73))","v":""},{"$f":"IF('teacher-wise time-table'!G71=\"\",\"\",CONCATENATE('teacher-wise time-table'!G71,\", \",'teacher-wise time-table'!G72,\", \",'teacher-wise time-table'!G73))","v":""},{"$f":"IF('teacher-wise time-table'!H71=\"\",\"\",CONCATENATE('teacher-wise time-table'!H71,\", \",'teacher-wise time-table'!H72,\", \",'teacher-wise time-table'!H73))","v":""},null,{"$f":"IF('teacher-wise time-table'!J71=\"\",\"\",CONCATENATE('teacher-wise time-table'!J71,\", \",'teacher-wise time-table'!J72,\", \",'teacher-wise time-table'!J73))","v":""},{"$f":"IF('teacher-wise time-table'!K71=\"\",\"\",CONCATENATE('teacher-wise time-table'!K71,\", \",'teacher-wise time-table'!K72,\", \",'teacher-wise time-table'!K73))","v":""},{"$f":"IF('teacher-wise time-table'!L71=\"\",\"\",CONCATENATE('teacher-wise time-table'!L71,\", \",'teacher-wise time-table'!L72,\", \",'teacher-wise time-table'!L73))","v":""},{"$f":"IF('teacher-wise time-table'!M71=\"\",\"\",CONCATENATE('teacher-wise time-table'!M71,\", \",'teacher-wise time-table'!M72,\", \",'teacher-wise time-table'!M73))","v":""}]
[{"$f":"'teacher-wise time-table'!A28","v":24},null,null,null,{"$f":"IF('teacher-wise time-table'!E74=\"\",\"\",CONCATENATE('teacher-wise time-table'!E74,\", \",'teacher-wise time-table'!E75,\", \",'teacher-wise time-table'!E76))","v":""},{"$f":"IF('teacher-wise time-table'!F74=\"\",\"\",CONCATENATE('teacher-wise time-table'!F74,\", \",'teacher-wise time-table'!F75,\", \",'teacher-wise time-table'!F76))","v":""},{"$f":"IF('teacher-wise time-table'!G74=\"\",\"\",CONCATENATE('teacher-wise time-table'!G74,\", \",'teacher-wise time-table'!G75,\", \",'teacher-wise time-table'!G76))","v":""},{"$f":"IF('teacher-wise time-table'!H74=\"\",\"\",CONCATENATE('teacher-wise time-table'!H74,\", \",'teacher-wise time-table'!H75,\", \",'teacher-wise time-table'!H76))","v":""},null,{"$f":"IF('teacher-wise time-table'!J74=\"\",\"\",CONCATENATE('teacher-wise time-table'!J74,\", \",'teacher-wise time-table'!J75,\", \",'teacher-wise time-table'!J76))","v":""},{"$f":"IF('teacher-wise time-table'!K74=\"\",\"\",CONCATENATE('teacher-wise time-table'!K74,\", \",'teacher-wise time-table'!K75,\", \",'teacher-wise time-table'!K76))","v":""},{"$f":"IF('teacher-wise time-table'!L74=\"\",\"\",CONCATENATE('teacher-wise time-table'!L74,\", \",'teacher-wise time-table'!L75,\", \",'teacher-wise time-table'!L76))","v":""},{"$f":"IF('teacher-wise time-table'!M74=\"\",\"\",CONCATENATE('teacher-wise time-table'!M74,\", \",'teacher-wise time-table'!M75,\", \",'teacher-wise time-table'!M76))","v":""}]
[{"$f":"'teacher-wise time-table'!A29","v":25},{"$f":"IF('teacher-wise time-table'!B29=\"\",\"\",CONCATENATE('teacher-wise time-table'!B29,\", \",'teacher-wise time-table'!B30,\", \",'teacher-wise time-table'!B31))","v":"MR. H, LECTURER, POL. SCIENCE "},{"$f":"IF('teacher-wise time-table'!C29=\"\",\"\",CONCATENATE('teacher-wise time-table'!C29,\", \",'teacher-wise time-table'!C30,\", \",'teacher-wise time-table'!C31))","v":"LECTURER, POL. SCIENCE , , "},{"$f":"IF('teacher-wise time-table'!D29=\"\",\"\",CONCATENATE('teacher-wise time-table'!D29,\", \",'teacher-wise time-table'!D30,\", \",'teacher-wise time-table'!D31))","v":"STUDENT WELFARE COMMISSION            CT 11 A, , "},{"$f":"IF('teacher-wise time-table'!E77=\"\",\"\",CONCATENATE('teacher-wise time-table'!E77,\", \",'teacher-wise time-table'!E78,\", \",'teacher-wise time-table'!E79))","v":""},{"$f":"IF('teacher-wise time-table'!F77=\"\",\"\",CONCATENATE('teacher-wise time-table'!F77,\", \",'teacher-wise time-table'!F78,\", \",'teacher-wise time-table'!F79))","v":""},{"$f":"IF('teacher-wise time-table'!G77=\"\",\"\",CONCATENATE('teacher-wise time-table'!G77,\", \",'teacher-wise time-table'!G78,\", \",'teacher-wise time-table'!G79))","v":""},{"$f":"IF('teacher-wise time-table'!H77=\"\",\"\",CONCATENATE('teacher-wise time-table'!H77,\", \",'teacher-wise time-table'!H78,\", \",'teacher-wise time-table'!H79))","v":""},null,{"$f":"IF('teacher-wise time-table'!J77=\"\",\"\",CONCATENATE('teacher-wise time-table'!J77,\", \",'teacher-wise time-table'!J78,\", \",'teacher-wise time-table'!J79))","v":""},{"$f":"IF('teacher-wise time-table'!K77=\"\",\"\",CONCATENATE('teacher-wise time-table'!K77,\", \",'teacher-wise time-table'!K78,\", \",'teacher-wise time-table'!K79))","v":""},{"$f":"IF('teacher-wise time-table'!L77=\"\",\"\",CONCATENATE('teacher-wise time-table'!L77,\", \",'teacher-wise time-table'!L78,\", \",'teacher-wise time-table'!L79))","v":""},{"$f":"IF('teacher-wise time-table'!M77=\"\",\"\",CONCATENATE('teacher-wise time-table'!M77,\", \",'teacher-wise time-table'!M78,\", \",'teacher-wise time-table'!M79))","v":""}]
[{"$f":"'teacher-wise time-table'!A30","v":26},null,null,null,{"$f":"IF('teacher-wise time-table'!E80=\"\",\"\",CONCATENATE('teacher-wise time-table'!E80,\", \",'teacher-wise time-table'!E81,\", \",'teacher-wise time-table'!E82))","v":""},{"$f":"IF('teacher-wise time-table'!F80=\"\",\"\",CONCATENATE('teacher-wise time-table'!F80,\", \",'teacher-wise time-table'!F81,\", \",'teacher-wise time-table'!F82))","v":""},{"$f":"IF('teacher-wise time-table'!G80=\"\",\"\",CONCATENATE('teacher-wise time-table'!G80,\", \",'teacher-wise time-table'!G81,\", \",'teacher-wise time-table'!G82))","v":""},{"$f":"IF('teacher-wise time-table'!H80=\"\",\"\",CONCATENATE('teacher-wise time-table'!H80,\", \",'teacher-wise time-table'!H81,\", \",'teacher-wise time-table'!H82))","v":""},null,{"$f":"IF('teacher-wise time-table'!J80=\"\",\"\",CONCATENATE('teacher-wise time-table'!J80,\", \",'teacher-wise time-table'!J81,\", \",'teacher-wise time-table'!J82))","v":""},{"$f":"IF('teacher-wise time-table'!K80=\"\",\"\",CONCATENATE('teacher-wise time-table'!K80,\", \",'teacher-wise time-table'!K81,\", \",'teacher-wise time-table'!K82))","v":""},{"$f":"IF('teacher-wise time-table'!L80=\"\",\"\",CONCATENATE('teacher-wise time-table'!L80,\", \",'teacher-wise time-table'!L81,\", \",'teacher-wise time-table'!L82))","v":""},{"$f":"IF('teacher-wise time-table'!M80=\"\",\"\",CONCATENATE('teacher-wise time-table'!M80,\", \",'teacher-wise time-table'!M81,\", \",'teacher-wise time-table'!M82))","v":""}]
[{"$f":"'teacher-wise time-table'!A31","v":27},null,null,null,{"$f":"IF('teacher-wise time-table'!E83=\"\",\"\",CONCATENATE('teacher-wise time-table'!E83,\", \",'teacher-wise time-table'!E84,\", \",'teacher-wise time-table'!E85))","v":""},{"$f":"IF('teacher-wise time-table'!F83=\"\",\"\",CONCATENATE('teacher-wise time-table'!F83,\", \",'teacher-wise time-table'!F84,\", \",'teacher-wise time-table'!F85))","v":""},{"$f":"IF('teacher-wise time-table'!G83=\"\",\"\",CONCATENATE('teacher-wise time-table'!G83,\", \",'teacher-wise time-table'!G84,\", \",'teacher-wise time-table'!G85))","v":""},{"$f":"IF('teacher-wise time-table'!H83=\"\",\"\",CONCATENATE('teacher-wise time-table'!H83,\", \",'teacher-wise time-table'!H84,\", \",'teacher-wise time-table'!H85))","v":""},null,{"$f":"IF('teacher-wise time-table'!J83=\"\",\"\",CONCATENATE('teacher-wise time-table'!J83,\", \",'teacher-wise time-table'!J84,\", \",'teacher-wise time-table'!J85))","v":""},{"$f":"IF('teacher-wise time-table'!K83=\"\",\"\",CONCATENATE('teacher-wise time-table'!K83,\", \",'teacher-wise time-table'!K84,\", \",'teacher-wise time-table'!K85))","v":""},{"$f":"IF('teacher-wise time-table'!L83=\"\",\"\",CONCATENATE('teacher-wise time-table'!L83,\", \",'teacher-wise time-table'!L84,\", \",'teacher-wise time-table'!L85))","v":""},{"$f":"IF('teacher-wise time-table'!M83=\"\",\"\",CONCATENATE('teacher-wise time-table'!M83,\", \",'teacher-wise time-table'!M84,\", \",'teacher-wise time-table'!M85))","v":""}]
[{"$f":"'teacher-wise time-table'!A32","v":28},{"$f":"IF('teacher-wise time-table'!B32=\"\",\"\",CONCATENATE('teacher-wise time-table'!B32,\", \",'teacher-wise time-table'!B33,\", \",'teacher-wise time-table'!B34))","v":"MR. I, GUEST LECTURER, POL. SCIENCE"},{"$f":"IF('teacher-wise time-table'!C32=\"\",\"\",CONCATENATE('teacher-wise time-table'!C32,\", \",'teacher-wise time-table'!C33,\", \",'teacher-wise time-table'!C34))","v":"GUEST LECTURER, POL. SCIENCE, , "},{"$f":"IF('teacher-wise time-table'!D32=\"\",\"\",CONCATENATE('teacher-wise time-table'!D32,\", \",'teacher-wise time-table'!D33,\", \",'teacher-wise time-table'!D34))","v":"CLASS TEACHER 11 C, , "},{"$f":"IF('teacher-wise time-table'!E86=\"\",\"\",CONCATENATE('teacher-wise time-table'!E86,\", \",'teacher-wise time-table'!E87,\", \",'teacher-wise time-table'!E88))","v":""},{"$f":"IF('teacher-wise time-table'!F86=\"\",\"\",CONCATENATE('teacher-wise time-table'!F86,\", \",'teacher-wise time-table'!F87,\", \",'teacher-wise time-table'!F88))","v":""},{"$f":"IF('teacher-wise time-table'!G86=\"\",\"\",CONCATENATE('teacher-wise time-table'!G86,\", \",'teacher-wise time-table'!G87,\", \",'teacher-wise time-table'!G88))","v":""},{"$f":"IF('teacher-wise time-table'!H86=\"\",\"\",CONCATENATE('teacher-wise time-table'!H86,\", \",'teacher-wise time-table'!H87,\", \",'teacher-wise time-table'!H88))","v":""},null,{"$f":"IF('teacher-wise time-table'!J86=\"\",\"\",CONCATENATE('teacher-wise time-table'!J86,\", \",'teacher-wise time-table'!J87,\", \",'teacher-wise time-table'!J88))","v":""},{"$f":"IF('teacher-wise time-table'!K86=\"\",\"\",CONCATENATE('teacher-wise time-table'!K86,\", \",'teacher-wise time-table'!K87,\", \",'teacher-wise time-table'!K88))","v":""},{"$f":"IF('teacher-wise time-table'!L86=\"\",\"\",CONCATENATE('teacher-wise time-table'!L86,\", \",'teacher-wise time-table'!L87,\", \",'teacher-wise time-table'!L88))","v":""},{"$f":"IF('teacher-wise time-table'!M86=\"\",\"\",CONCATENATE('teacher-wise time-table'!M86,\", \",'teacher-wise time-table'!M87,\", \",'teacher-wise time-table'!M88))","v":""}]
[{"$f":"'teacher-wise time-table'!A33","v":29},null,null,null,{"$f":"IF('teacher-wise time-table'!E89=\"\",\"\",CONCATENATE('teacher-wise time-table'!E89,\", \",'teacher-wise time-table'!E90,\", \",'teacher-wise time-table'!E91))","v":""},{"$f":"IF('teacher-wise time-table'!F89=\"\",\"\",CONCATENATE('teacher-wise time-table'!F89,\", \",'teacher-wise time-table'!F90,\", \",'teacher-wise time-table'!F91))","v":""},{"$f":"IF('teacher-wise time-table'!G89=\"\",\"\",CONCATENATE('teacher-wise time-table'!G89,\", \",'teacher-wise time-table'!G90,\", \",'teacher-wise time-table'!G91))","v":""},{"$f":"IF('teacher-wise time-table'!H89=\"\",\"\",CONCATENATE('teacher-wise time-table'!H89,\", \",'teacher-wise time-table'!H90,\", \",'teacher-wise time-table'!H91))","v":""},null,{"$f":"IF('teacher-wise time-table'!J89=\"\",\"\",CONCATENATE('teacher-wise time-table'!J89,\", \",'teacher-wise time-table'!J90,\", \",'teacher-wise time-table'!J91))","v":""},{"$f":"IF('teacher-wise time-table'!K89=\"\",\"\",CONCATENATE('teacher-wise time-table'!K89,\", \",'teacher-wise time-table'!K90,\", \",'teacher-wise time-table'!K91))","v":""},{"$f":"IF('teacher-wise time-table'!L89=\"\",\"\",CONCATENATE('teacher-wise time-table'!L89,\", \",'teacher-wise time-table'!L90,\", \",'teacher-wise time-table'!L91))","v":""},{"$f":"IF('teacher-wise time-table'!M89=\"\",\"\",CONCATENATE('teacher-wise time-table'!M89,\", \",'teacher-wise time-table'!M90,\", \",'teacher-wise time-table'!M91))","v":""}]
[{"$f":"'teacher-wise time-table'!A34","v":30},null,null,null,{"$f":"IF('teacher-wise time-table'!E92=\"\",\"\",CONCATENATE('teacher-wise time-table'!E92,\", \",'teacher-wise time-table'!E93,\", \",'teacher-wise time-table'!E94))","v":""},{"$f":"IF('teacher-wise time-table'!F92=\"\",\"\",CONCATENATE('teacher-wise time-table'!F92,\", \",'teacher-wise time-table'!F93,\", \",'teacher-wise time-table'!F94))","v":""},{"$f":"IF('teacher-wise time-table'!G92=\"\",\"\",CONCATENATE('teacher-wise time-table'!G92,\", \",'teacher-wise time-table'!G93,\", \",'teacher-wise time-table'!G94))","v":""},{"$f":"IF('teacher-wise time-table'!H92=\"\",\"\",CONCATENATE('teacher-wise time-table'!H92,\", \",'teacher-wise time-table'!H93,\", \",'teacher-wise time-table'!H94))","v":""},null,{"$f":"IF('teacher-wise time-table'!J92=\"\",\"\",CONCATENATE('teacher-wise time-table'!J92,\", \",'teacher-wise time-table'!J93,\", \",'teacher-wise time-table'!J94))","v":""},{"$f":"IF('teacher-wise time-table'!K92=\"\",\"\",CONCATENATE('teacher-wise time-table'!K92,\", \",'teacher-wise time-table'!K93,\", \",'teacher-wise time-table'!K94))","v":""},{"$f":"IF('teacher-wise time-table'!L92=\"\",\"\",CONCATENATE('teacher-wise time-table'!L92,\", \",'teacher-wise time-table'!L93,\", \",'teacher-wise time-table'!L94))","v":""},{"$f":"IF('teacher-wise time-table'!M92=\"\",\"\",CONCATENATE('teacher-wise time-table'!M92,\", \",'teacher-wise time-table'!M93,\", \",'teacher-wise time-table'!M94))","v":""}]
[{"$f":"'teacher-wise time-table'!A35","v":31},{"$f":"IF('teacher-wise time-table'!B35=\"\",\"\",CONCATENATE('teacher-wise time-table'!B35,\", \",'teacher-wise time-table'!B36,\", \",'teacher-wise time-table'!B37))","v":"MR. J, LECTURER, H. SCIENCE "},{"$f":"IF('teacher-wise time-table'!C35=\"\",\"\",CONCATENATE('teacher-wise time-table'!C35,\", \",'teacher-wise time-table'!C36,\", \",'teacher-wise time-table'!C37))","v":"LECTURER, H. SCIENCE , , "},{"$f":"IF('teacher-wise time-table'!D35=\"\",\"\",CONCATENATE('teacher-wise time-table'!D35,\", \",'teacher-wise time-table'!D36,\", \",'teacher-wise time-table'!D37))","v":"CLASS TEACHER            12 C, , "},{"$f":"IF('teacher-wise time-table'!E95=\"\",\"\",CONCATENATE('teacher-wise time-table'!E95,\", \",'teacher-wise time-table'!E96,\", \",'teacher-wise time-table'!E97))","v":""},{"$f":"IF('teacher-wise time-table'!F95=\"\",\"\",CONCATENATE('teacher-wise time-table'!F95,\", \",'teacher-wise time-table'!F96,\", \",'teacher-wise time-table'!F97))","v":""},{"$f":"IF('teacher-wise time-table'!G95=\"\",\"\",CONCATENATE('teacher-wise time-table'!G95,\", \",'teacher-wise time-table'!G96,\", \",'teacher-wise time-table'!G97))","v":""},{"$f":"IF('teacher-wise time-table'!H95=\"\",\"\",CONCATENATE('teacher-wise time-table'!H95,\", \",'teacher-wise time-table'!H96,\", \",'teacher-wise time-table'!H97))","v":""},null,{"$f":"IF('teacher-wise time-table'!J95=\"\",\"\",CONCATENATE('teacher-wise time-table'!J95,\", \",'teacher-wise time-table'!J96,\", \",'teacher-wise time-table'!J97))","v":""},{"$f":"IF('teacher-wise time-table'!K95=\"\",\"\",CONCATENATE('teacher-wise time-table'!K95,\", \",'teacher-wise time-table'!K96,\", \",'teacher-wise time-table'!K97))","v":""},{"$f":"IF('teacher-wise time-table'!L95=\"\",\"\",CONCATENATE('teacher-wise time-table'!L95,\", \",'teacher-wise time-table'!L96,\", \",'teacher-wise time-table'!L97))","v":""},{"$f":"IF('teacher-wise time-table'!M95=\"\",\"\",CONCATENATE('teacher-wise time-table'!M95,\", \",'teacher-wise time-table'!M96,\", \",'teacher-wise time-table'!M97))","v":""}]
[{"$f":"'teacher-wise time-table'!A36","v":32},null,null,null,{"$f":"IF('teacher-wise time-table'!E98=\"\",\"\",CONCATENATE('teacher-wise time-table'!E98,\", \",'teacher-wise time-table'!E99,\", \",'teacher-wise time-table'!E100))","v":""},{"$f":"IF('teacher-wise time-table'!F98=\"\",\"\",CONCATENATE('teacher-wise time-table'!F98,\", \",'teacher-wise time-table'!F99,\", \",'teacher-wise time-table'!F100))","v":""},{"$f":"IF('teacher-wise time-table'!G98=\"\",\"\",CONCATENATE('teacher-wise time-table'!G98,\", \",'teacher-wise time-table'!G99,\", \",'teacher-wise time-table'!G100))","v":""},{"$f":"IF('teacher-wise time-table'!H98=\"\",\"\",CONCATENATE('teacher-wise time-table'!H98,\", \",'teacher-wise time-table'!H99,\", \",'teacher-wise time-table'!H100))","v":""},null,{"$f":"IF('teacher-wise time-table'!J98=\"\",\"\",CONCATENATE('teacher-wise time-table'!J98,\", \",'teacher-wise time-table'!J99,\", \",'teacher-wise time-table'!J100))","v":""},{"$f":"IF('teacher-wise time-table'!K98=\"\",\"\",CONCATENATE('teacher-wise time-table'!K98,\", \",'teacher-wise time-table'!K99,\", \",'teacher-wise time-table'!K100))","v":""},{"$f":"IF('teacher-wise time-table'!L98=\"\",\"\",CONCATENATE('teacher-wise time-table'!L98,\", \",'teacher-wise time-table'!L99,\", \",'teacher-wise time-table'!L100))","v":""},{"$f":"IF('teacher-wise time-table'!M98=\"\",\"\",CONCATENATE('teacher-wise time-table'!M98,\", \",'teacher-wise time-table'!M99,\", \",'teacher-wise time-table'!M100))","v":""}]
[{"$f":"'teacher-wise time-table'!A37","v":33},null,null,null,{"$f":"IF('teacher-wise time-table'!E101=\"\",\"\",CONCATENATE('teacher-wise time-table'!E101,\", \",'teacher-wise time-table'!E102,\", \",'teacher-wise time-table'!E103))","v":""},{"$f":"IF('teacher-wise time-table'!F101=\"\",\"\",CONCATENATE('teacher-wise time-table'!F101,\", \",'teacher-wise time-table'!F102,\", \",'teacher-wise time-table'!F103))","v":""},{"$f":"IF('teacher-wise time-table'!G101=\"\",\"\",CONCATENATE('teacher-wise time-table'!G101,\", \",'teacher-wise time-table'!G102,\", \",'teacher-wise time-table'!G103))","v":""},{"$f":"IF('teacher-wise time-table'!H101=\"\",\"\",CONCATENATE('teacher-wise time-table'!H101,\", \",'teacher-wise time-table'!H102,\", \",'teacher-wise time-table'!H103))","v":""},null,{"$f":"IF('teacher-wise time-table'!J101=\"\",\"\",CONCATENATE('teacher-wise time-table'!J101,\", \",'teacher-wise time-table'!J102,\", \",'teacher-wise time-table'!J103))","v":""},{"$f":"IF('teacher-wise time-table'!K101=\"\",\"\",CONCATENATE('teacher-wise time-table'!K101,\", \",'teacher-wise time-table'!K102,\", \",'teacher-wise time-table'!K103))","v":""},{"$f":"IF('teacher-wise time-table'!L101=\"\",\"\",CONCATENATE('teacher-wise time-table'!L101,\", \",'teacher-wise time-table'!L102,\", \",'teacher-wise time-table'!L103))","v":""},{"$f":"IF('teacher-wise time-table'!M101=\"\",\"\",CONCATENATE('teacher-wise time-table'!M101,\", \",'teacher-wise time-table'!M102,\", \",'teacher-wise time-table'!M103))","v":""}]
[{"$f":"'teacher-wise time-table'!A38","v":34},{"$f":"IF('teacher-wise time-table'!B38=\"\",\"\",CONCATENATE('teacher-wise time-table'!B38,\", \",'teacher-wise time-table'!B39,\", \",'teacher-wise time-table'!B40))","v":"MR. K, SN. TEACHER, URDU "},{"$f":"IF('teacher-wise time-table'!C38=\"\",\"\",CONCATENATE('teacher-wise time-table'!C38,\", \",'teacher-wise time-table'!C39,\", \",'teacher-wise time-table'!C40))","v":"SN. TEACHER, URDU , , "},{"$f":"IF('teacher-wise time-table'!D38=\"\",\"\",CONCATENATE('teacher-wise time-table'!D38,\", \",'teacher-wise time-table'!D39,\", \",'teacher-wise time-table'!D40))","v":"IN-CHARGE BOARD EXAM., , "},{"$f":"IF('teacher-wise time-table'!E104=\"\",\"\",CONCATENATE('teacher-wise time-table'!E104,\", \",'teacher-wise time-table'!E105,\", \",'teacher-wise time-table'!E106))","v":""},{"$f":"IF('teacher-wise time-table'!F104=\"\",\"\",CONCATENATE('teacher-wise time-table'!F104,\", \",'teacher-wise time-table'!F105,\", \",'teacher-wise time-table'!F106))","v":""},{"$f":"IF('teacher-wise time-table'!G104=\"\",\"\",CONCATENATE('teacher-wise time-table'!G104,\", \",'teacher-wise time-table'!G105,\", \",'teacher-wise time-table'!G106))","v":""},{"$f":"IF('teacher-wise time-table'!H104=\"\",\"\",CONCATENATE('teacher-wise time-table'!H104,\", \",'teacher-wise time-table'!H105,\", \",'teacher-wise time-table'!H106))","v":""},null,{"$f":"IF('teacher-wise time-table'!J104=\"\",\"\",CONCATENATE('teacher-wise time-table'!J104,\", \",'teacher-wise time-table'!J105,\", \",'teacher-wise time-table'!J106))","v":""},{"$f":"IF('teacher-wise time-table'!K104=\"\",\"\",CONCATENATE('teacher-wise time-table'!K104,\", \",'teacher-wise time-table'!K105,\", \",'teacher-wise time-table'!K106))","v":""},{"$f":"IF('teacher-wise time-table'!L104=\"\",\"\",CONCATENATE('teacher-wise time-table'!L104,\", \",'teacher-wise time-table'!L105,\", \",'teacher-wise time-table'!L106))","v":""},{"$f":"IF('teacher-wise time-table'!M104=\"\",\"\",CONCATENATE('teacher-wise time-table'!M104,\", \",'teacher-wise time-table'!M105,\", \",'teacher-wise time-table'!M106))","v":""}]
[{"$f":"'teacher-wise time-table'!A39","v":35}]
[{"$f":"'teacher-wise time-table'!A40","v":36}]
[{"$f":"'teacher-wise time-table'!A41","v":37},{"$f":"IF('teacher-wise time-table'!B41=\"\",\"\",CONCATENATE('teacher-wise time-table'!B41,\", \",'teacher-wise time-table'!B42,\", \",'teacher-wise time-table'!B43))","v":"VACANT POST 2, LECTURER, GEOGRAPHY"},{"$f":"IF('teacher-wise time-table'!C41=\"\",\"\",CONCATENATE('teacher-wise time-table'!C41,\", \",'teacher-wise time-table'!C42,\", \",'teacher-wise time-table'!C43))","v":"LECTURER, GEOGRAPHY, , "},{"$f":"IF('teacher-wise time-table'!D41=\"\",\"\",CONCATENATE('teacher-wise time-table'!D41,\", \",'teacher-wise time-table'!D42,\", \",'teacher-wise time-table'!D43))","v":""}]
[{"$f":"'teacher-wise time-table'!A42","v":38}]
[{"$f":"'teacher-wise time-table'!A43","v":39}]
[{"$f":"'teacher-wise time-table'!A44","v":40},{"$f":"IF('teacher-wise time-table'!B44=\"\",\"\",CONCATENATE('teacher-wise time-table'!B44,\", \",'teacher-wise time-table'!B45,\", \",'teacher-wise time-table'!B46))","v":"MR. K, PTI, GRADE II"},{"$f":"IF('teacher-wise time-table'!C44=\"\",\"\",CONCATENATE('teacher-wise time-table'!C44,\", \",'teacher-wise time-table'!C45,\", \",'teacher-wise time-table'!C46))","v":"PTI, GRADE II, , "},{"$f":"IF('teacher-wise time-table'!D44=\"\",\"\",CONCATENATE('teacher-wise time-table'!D44,\", \",'teacher-wise time-table'!D45,\", \",'teacher-wise time-table'!D46))","v":"DISCIPLINE, , "}]
[{"$f":"'teacher-wise time-table'!A45","v":41}]
[{"$f":"'teacher-wise time-table'!A46","v":42}]
[{"$f":"'teacher-wise time-table'!A47","v":43},{"$f":"IF('teacher-wise time-table'!B47=\"\",\"\",CONCATENATE('teacher-wise time-table'!B47,\", \",'teacher-wise time-table'!B48,\", \",'teacher-wise time-table'!B49))","v":"MR. L, LAB. ASSTT., BIOLOGY"},{"$f":"IF('teacher-wise time-table'!C47=\"\",\"\",CONCATENATE('teacher-wise time-table'!C47,\", \",'teacher-wise time-table'!C48,\", \",'teacher-wise time-table'!C49))","v":"LAB. ASSTT., BIOLOGY, , "},{"$f":"IF('teacher-wise time-table'!D47=\"\",\"\",CONCATENATE('teacher-wise time-table'!D47,\", \",'teacher-wise time-table'!D48,\", \",'teacher-wise time-table'!D49))","v":"ASSTT.                       IN-CHARGE         LOCAL EXAM., , "}]
[{"$f":"'teacher-wise time-table'!A48","v":44}]
[{"$f":"'teacher-wise time-table'!A49","v":45}]
[{"$f":"'teacher-wise time-table'!A50","v":46},{"$f":"IF('teacher-wise time-table'!B50=\"\",\"\",CONCATENATE('teacher-wise time-table'!B50,\", \",'teacher-wise time-table'!B51,\", \",'teacher-wise time-table'!B52))","v":"MR. M, LAB. ASSTT., CHEMISTRY"},{"$f":"IF('teacher-wise time-table'!C50=\"\",\"\",CONCATENATE('teacher-wise time-table'!C50,\", \",'teacher-wise time-table'!C51,\", \",'teacher-wise time-table'!C52))","v":"LAB. ASSTT., CHEMISTRY, , "},{"$f":"IF('teacher-wise time-table'!D50=\"\",\"\",CONCATENATE('teacher-wise time-table'!D50,\", \",'teacher-wise time-table'!D51,\", \",'teacher-wise time-table'!D52))","v":"CLASS TEACHER       11 D + ASSTT.      IN-CHARGE  BOARD EXAM., , "}]
[{"$f":"'teacher-wise time-table'!A51","v":47}]
[{"$f":"'teacher-wise time-table'!A52","v":48}]
[{"$f":"'teacher-wise time-table'!A53","v":49},{"$f":"IF('teacher-wise time-table'!B53=\"\",\"\",CONCATENATE('teacher-wise time-table'!B53,\", \",'teacher-wise time-table'!B54,\", \",'teacher-wise time-table'!B55))","v":"MR. N, LAB. ASSTT., PHYSICS"},{"$f":"IF('teacher-wise time-table'!C53=\"\",\"\",CONCATENATE('teacher-wise time-table'!C53,\", \",'teacher-wise time-table'!C54,\", \",'teacher-wise time-table'!C55))","v":"LAB. ASSTT., PHYSICS, , "},{"$f":"IF('teacher-wise time-table'!D53=\"\",\"\",CONCATENATE('teacher-wise time-table'!D53,\", \",'teacher-wise time-table'!D54,\", \",'teacher-wise time-table'!D55))","v":"CLASS TEACHER       11 E, , "}]
[{"$f":"'teacher-wise time-table'!A54","v":50}]
[{"$f":"'teacher-wise time-table'!A55","v":51}]
[{"$f":"'teacher-wise time-table'!A56","v":52},{"$f":"IF('teacher-wise time-table'!B56=\"\",\"\",CONCATENATE('teacher-wise time-table'!B56,\", \",'teacher-wise time-table'!B57,\", \",'teacher-wise time-table'!B58))","v":""},{"$f":"IF('teacher-wise time-table'!C56=\"\",\"\",CONCATENATE('teacher-wise time-table'!C56,\", \",'teacher-wise time-table'!C57,\", \",'teacher-wise time-table'!C58))","v":""},{"$f":"IF('teacher-wise time-table'!D56=\"\",\"\",CONCATENATE('teacher-wise time-table'!D56,\", \",'teacher-wise time-table'!D57,\", \",'teacher-wise time-table'!D58))","v":""}]
[{"$f":"'teacher-wise time-table'!A57","v":53}]
[{"$f":"'teacher-wise time-table'!A58","v":54}]
[{"$f":"'teacher-wise time-table'!A59","v":55},{"$f":"IF('teacher-wise time-table'!B59=\"\",\"\",CONCATENATE('teacher-wise time-table'!B59,\", \",'teacher-wise time-table'!B60,\", \",'teacher-wise time-table'!B61))","v":""},{"$f":"IF('teacher-wise time-table'!C59=\"\",\"\",CONCATENATE('teacher-wise time-table'!C59,\", \",'teacher-wise time-table'!C60,\", \",'teacher-wise time-table'!C61))","v":""},{"$f":"IF('teacher-wise time-table'!D59=\"\",\"\",CONCATENATE('teacher-wise time-table'!D59,\", \",'teacher-wise time-table'!D60,\", \",'teacher-wise time-table'!D61))","v":""}]
[{"$f":"'teacher-wise time-table'!A60","v":56}]
[{"$f":"'teacher-wise time-table'!A61","v":57}]
[{"$f":"'teacher-wise time-table'!A62","v":58},{"$f":"IF('teacher-wise time-table'!B62=\"\",\"\",CONCATENATE('teacher-wise time-table'!B62,\", \",'teacher-wise time-table'!B63,\", \",'teacher-wise time-table'!B64))","v":""},{"$f":"IF('teacher-wise time-table'!C62=\"\",\"\",CONCATENATE('teacher-wise time-table'!C62,\", \",'teacher-wise time-table'!C63,\", \",'teacher-wise time-table'!C64))","v":""},{"$f":"IF('teacher-wise time-table'!D62=\"\",\"\",CONCATENATE('teacher-wise time-table'!D62,\", \",'teacher-wise time-table'!D63,\", \",'teacher-wise time-table'!D64))","v":""}]
[{"$f":"'teacher-wise time-table'!A63","v":59}]
[{"$f":"'teacher-wise time-table'!A64","v":60}]
[{"$f":"'teacher-wise time-table'!A65","v":61},{"$f":"IF('teacher-wise time-table'!B65=\"\",\"\",CONCATENATE('teacher-wise time-table'!B65,\", \",'teacher-wise time-table'!B66,\", \",'teacher-wise time-table'!B67))","v":""},{"$f":"IF('teacher-wise time-table'!C65=\"\",\"\",CONCATENATE('teacher-wise time-table'!C65,\", \",'teacher-wise time-table'!C66,\", \",'teacher-wise time-table'!C67))","v":""},{"$f":"IF('teacher-wise time-table'!D65=\"\",\"\",CONCATENATE('teacher-wise time-table'!D65,\", \",'teacher-wise time-table'!D66,\", \",'teacher-wise time-table'!D67))","v":""}]
[{"$f":"'teacher-wise time-table'!A66","v":62}]
[{"$f":"'teacher-wise time-table'!A67","v":63}]
[{"$f":"'teacher-wise time-table'!A68","v":64},{"$f":"IF('teacher-wise time-table'!B68=\"\",\"\",CONCATENATE('teacher-wise time-table'!B68,\", \",'teacher-wise time-table'!B69,\", \",'teacher-wise time-table'!B70))","v":""},{"$f":"IF('teacher-wise time-table'!C68=\"\",\"\",CONCATENATE('teacher-wise time-table'!C68,\", \",'teacher-wise time-table'!C69,\", \",'teacher-wise time-table'!C70))","v":""},{"$f":"IF('teacher-wise time-table'!D68=\"\",\"\",CONCATENATE('teacher-wise time-table'!D68,\", \",'teacher-wise time-table'!D69,\", \",'teacher-wise time-table'!D70))","v":""}]
[{"$f":"'teacher-wise time-table'!A69","v":65}]
[{"$f":"'teacher-wise time-table'!A70","v":66}]
[{"$f":"'teacher-wise time-table'!A71","v":67},{"$f":"IF('teacher-wise time-table'!B71=\"\",\"\",CONCATENATE('teacher-wise time-table'!B71,\", \",'teacher-wise time-table'!B72,\", \",'teacher-wise time-table'!B73))","v":""},{"$f":"IF('teacher-wise time-table'!C71=\"\",\"\",CONCATENATE('teacher-wise time-table'!C71,\", \",'teacher-wise time-table'!C72,\", \",'teacher-wise time-table'!C73))","v":""},{"$f":"IF('teacher-wise time-table'!D71=\"\",\"\",CONCATENATE('teacher-wise time-table'!D71,\", \",'teacher-wise time-table'!D72,\", \",'teacher-wise time-table'!D73))","v":""}]
[{"$f":"'teacher-wise time-table'!A72","v":68}]
[{"$f":"'teacher-wise time-table'!A73","v":69}]
[{"$f":"'teacher-wise time-table'!A74","v":70},{"$f":"IF('teacher-wise time-table'!B74=\"\",\"\",CONCATENATE('teacher-wise time-table'!B74,\", \",'teacher-wise time-table'!B75,\", \",'teacher-wise time-table'!B76))","v":""},{"$f":"IF('teacher-wise time-table'!C74=\"\",\"\",CONCATENATE('teacher-wise time-table'!C74,\", \",'teacher-wise time-table'!C75,\", \",'teacher-wise time-table'!C76))","v":""},{"$f":"IF('teacher-wise time-table'!D74=\"\",\"\",CONCATENATE('teacher-wise time-table'!D74,\", \",'teacher-wise time-table'!D75,\", \",'teacher-wise time-table'!D76))","v":""}]
[{"$f":"'teacher-wise time-table'!A75","v":71}]
[{"$f":"'teacher-wise time-table'!A76","v":72}]
[{"$f":"'teacher-wise time-table'!A77","v":73},{"$f":"IF('teacher-wise time-table'!B77=\"\",\"\",CONCATENATE('teacher-wise time-table'!B77,\", \",'teacher-wise time-table'!B78,\", \",'teacher-wise time-table'!B79))","v":""},{"$f":"IF('teacher-wise time-table'!C77=\"\",\"\",CONCATENATE('teacher-wise time-table'!C77,\", \",'teacher-wise time-table'!C78,\", \",'teacher-wise time-table'!C79))","v":""},{"$f":"IF('teacher-wise time-table'!D77=\"\",\"\",CONCATENATE('teacher-wise time-table'!D77,\", \",'teacher-wise time-table'!D78,\", \",'teacher-wise time-table'!D79))","v":""}]
[{"$f":"'teacher-wise time-table'!A78","v":74}]
[{"$f":"'teacher-wise time-table'!A79","v":75}]
[{"$f":"'teacher-wise time-table'!A80","v":76},{"$f":"IF('teacher-wise time-table'!B80=\"\",\"\",CONCATENATE('teacher-wise time-table'!B80,\", \",'teacher-wise time-table'!B81,\", \",'teacher-wise time-table'!B82))","v":""},{"$f":"IF('teacher-wise time-table'!C80=\"\",\"\",CONCATENATE('teacher-wise time-table'!C80,\", \",'teacher-wise time-table'!C81,\", \",'teacher-wise time-table'!C82))","v":""},{"$f":"IF('teacher-wise time-table'!D80=\"\",\"\",CONCATENATE('teacher-wise time-table'!D80,\", \",'teacher-wise time-table'!D81,\", \",'teacher-wise time-table'!D82))","v":""}]
[{"$f":"'teacher-wise time-table'!A81","v":77}]
[{"$f":"'teacher-wise time-table'!A82","v":78}]
[{"$f":"'teacher-wise time-table'!A83","v":79},{"$f":"IF('teacher-wise time-table'!B83=\"\",\"\",CONCATENATE('teacher-wise time-table'!B83,\", \",'teacher-wise time-table'!B84,\", \",'teacher-wise time-table'!B85))","v":""},{"$f":"IF('teacher-wise time-table'!C83=\"\",\"\",CONCATENATE('teacher-wise time-table'!C83,\", \",'teacher-wise time-table'!C84,\", \",'teacher-wise time-table'!C85))","v":""},{"$f":"IF('teacher-wise time-table'!D83=\"\",\"\",CONCATENATE('teacher-wise time-table'!D83,\", \",'teacher-wise time-table'!D84,\", \",'teacher-wise time-table'!D85))","v":""}]
[{"$f":"'teacher-wise time-table'!A84","v":80}]
[{"$f":"'teacher-wise time-table'!A85","v":81}]
[{"$f":"'teacher-wise time-table'!A86","v":82},{"$f":"IF('teacher-wise time-table'!B86=\"\",\"\",CONCATENATE('teacher-wise time-table'!B86,\", \",'teacher-wise time-table'!B87,\", \",'teacher-wise time-table'!B88))","v":""},{"$f":"IF('teacher-wise time-table'!C86=\"\",\"\",CONCATENATE('teacher-wise time-table'!C86,\", \",'teacher-wise time-table'!C87,\", \",'teacher-wise time-table'!C88))","v":""},{"$f":"IF('teacher-wise time-table'!D86=\"\",\"\",CONCATENATE('teacher-wise time-table'!D86,\", \",'teacher-wise time-table'!D87,\", \",'teacher-wise time-table'!D88))","v":""}]
[{"$f":"'teacher-wise time-table'!A87","v":83}]
[{"$f":"'teacher-wise time-table'!A88","v":84}]
[{"$f":"'teacher-wise time-table'!A89","v":85},{"$f":"IF('teacher-wise time-table'!B89=\"\",\"\",CONCATENATE('teacher-wise time-table'!B89,\", \",'teacher-wise time-table'!B90,\", \",'teacher-wise time-table'!B91))","v":""},{"$f":"IF('teacher-wise time-table'!C89=\"\",\"\",CONCATENATE('teacher-wise time-table'!C89,\", \",'teacher-wise time-table'!C90,\", \",'teacher-wise time-table'!C91))","v":""},{"$f":"IF('teacher-wise time-table'!D89=\"\",\"\",CONCATENATE('teacher-wise time-table'!D89,\", \",'teacher-wise time-table'!D90,\", \",'teacher-wise time-table'!D91))","v":""}]
[{"$f":"'teacher-wise time-table'!A90","v":86}]
[{"$f":"'teacher-wise time-table'!A91","v":87}]
[{"$f":"'teacher-wise time-table'!A92","v":88},{"$f":"IF('teacher-wise time-table'!B92=\"\",\"\",CONCATENATE('teacher-wise time-table'!B92,\", \",'teacher-wise time-table'!B93,\", \",'teacher-wise time-table'!B94))","v":""},{"$f":"IF('teacher-wise time-table'!C92=\"\",\"\",CONCATENATE('teacher-wise time-table'!C92,\", \",'teacher-wise time-table'!C93,\", \",'teacher-wise time-table'!C94))","v":""},{"$f":"IF('teacher-wise time-table'!D92=\"\",\"\",CONCATENATE('teacher-wise time-table'!D92,\", \",'teacher-wise time-table'!D93,\", \",'teacher-wise time-table'!D94))","v":""}]
[{"$f":"'teacher-wise time-table'!A93","v":89}]
[{"$f":"'teacher-wise time-table'!A94","v":90}]
[{"$f":"'teacher-wise time-table'!A95","v":91},{"$f":"IF('teacher-wise time-table'!B95=\"\",\"\",CONCATENATE('teacher-wise time-table'!B95,\", \",'teacher-wise time-table'!B96,\", \",'teacher-wise time-table'!B97))","v":""},{"$f":"IF('teacher-wise time-table'!C95=\"\",\"\",CONCATENATE('teacher-wise time-table'!C95,\", \",'teacher-wise time-table'!C96,\", \",'teacher-wise time-table'!C97))","v":""},{"$f":"IF('teacher-wise time-table'!D95=\"\",\"\",CONCATENATE('teacher-wise time-table'!D95,\", \",'teacher-wise time-table'!D96,\", \",'teacher-wise time-table'!D97))","v":""}]
[{"$f":"'teacher-wise time-table'!A96","v":92}]
[{"$f":"'teacher-wise time-table'!A97","v":93}]
[{"$f":"'teacher-wise time-table'!A98","v":94},{"$f":"IF('teacher-wise time-table'!B98=\"\",\"\",CONCATENATE('teacher-wise time-table'!B98,\", \",'teacher-wise time-table'!B99,\", \",'teacher-wise time-table'!B100))","v":""},{"$f":"IF('teacher-wise time-table'!C98=\"\",\"\",CONCATENATE('teacher-wise time-table'!C98,\", \",'teacher-wise time-table'!C99,\", \",'teacher-wise time-table'!C100))","v":""},{"$f":"IF('teacher-wise time-table'!D98=\"\",\"\",CONCATENATE('teacher-wise time-table'!D98,\", \",'teacher-wise time-table'!D99,\", \",'teacher-wise time-table'!D100))","v":""}]
[{"$f":"'teacher-wise time-table'!A99","v":95}]
[{"$f":"'teacher-wise time-table'!A100","v":96}]
[{"$f":"'teacher-wise time-table'!A101","v":97},{"$f":"IF('teacher-wise time-table'!B101=\"\",\"\",CONCATENATE('teacher-wise time-table'!B101,\", \",'teacher-wise time-table'!B102,\", \",'teacher-wise time-table'!B103))","v":""},{"$f":"IF('teacher-wise time-table'!C101=\"\",\"\",CONCATENATE('teacher-wise time-table'!C101,\", \",'teacher-wise time-table'!C102,\", \",'teacher-wise time-table'!C103))","v":""},{"$f":"IF('teacher-wise time-table'!D101=\"\",\"\",CONCATENATE('teacher-wise time-table'!D101,\", \",'teacher-wise time-table'!D102,\", \",'teacher-wise time-table'!D103))","v":""}]
[{"$f":"'teacher-wise time-table'!A102","v":98}]
[{"$f":"'teacher-wise time-table'!A103","v":99}]
[{"$f":"'teacher-wise time-table'!A104","v":100},{"$f":"IF('teacher-wise time-table'!B104=\"\",\"\",CONCATENATE('teacher-wise time-table'!B104,\", \",'teacher-wise time-table'!B105,\", \",'teacher-wise time-table'!B106))","v":""},{"$f":"IF('teacher-wise time-table'!C104=\"\",\"\",CONCATENATE('teacher-wise time-table'!C104,\", \",'teacher-wise time-table'!C105,\", \",'teacher-wise time-table'!C106))","v":""},{"$f":"IF('teacher-wise time-table'!D104=\"\",\"\",CONCATENATE('teacher-wise time-table'!D104,\", \",'teacher-wise time-table'!D105,\", \",'teacher-wise time-table'!D106))","v":""}]
[{"$f":"'teacher-wise time-table'!A105","v":101}]
[{"$f":"'teacher-wise time-table'!A106","v":102}]